program: Gaussian 09
title: 000178992
version: EM64L-G09RevD.01
frameworkgroup: C1[X(C20H21FN2O2)]
method: RPBEPBE
basis: SDD
operation: Freq
keyword: #p
keyword: freq=noraman
keyword: PBEPBE/SDD
title: #p freq=noraman PBEPBE/SDD
converged: YES YES NO NO
title: Mulliken charges:
elementType: F O O N N C C C C C C C C C C C C C C C C C C C C H H H H H H H H H H H H H H H H H H H H H
charge: -0.213827 -0.222489 -0.267552 -0.398182 -0.055551 0.175951 -0.306642 0.344169 0.201747 -0.385042 -0.756673 -0.754245 0.179580 0.076977 -0.696087 0.191045 -0.357334 0.194988 -0.344410 -0.377804 -0.257179 -0.371397 -0.211709 -0.268083 -0.197536 0.239004 0.330648 0.223422 0.227863 0.222433 0.253180 0.236212 0.225129 0.276396 0.209997 0.219316 0.210331 0.232741 0.254322 0.281982 0.254526 0.228265 0.255696 0.234432 0.229635 0.231754
chargesum: 0.00000
title: Mulliken charges with hydrogens summed into heavy atoms:
elementType: F O O N N C C C C C C C C C C C C C C C C C C C C
charge: -0.213827 -0.222489 -0.267552 -0.067534 -0.055551 0.175951 -0.067638 0.344169 0.201747 0.066243 -0.044847 -0.042723 0.179580 0.076977 -0.033699 0.191045 -0.103012 0.194988 -0.062428 -0.123278 -0.028914 -0.115701 0.022722 -0.038449 0.034219
polarizability: 2.02821160e+02 1.21495708e+01 2.58904914e+02 2.91148803e+01 -1.50440101e+01 1.98782667e+02
1716.lowfreq: -6.9998 -6.6410 -0.0010 -0.0009 -0.0007 7.5121 16.9507 17.7927 32.6851
frequency: 15.8813 17.6586 32.4403 44.7063 49.3027 61.3749 86.6193 115.0238 118.9009 129.0193 166.2815 187.1926 199.6571 207.7576 218.9359 226.4590 247.2442 270.2135 286.5925 305.5706 309.5230 314.0699 340.0739 343.3506 394.2068 413.4168 424.3403 433.9178 459.5280 472.0595 488.3894 504.2851 535.2620 544.6520 547.9407 566.1764 572.9928 589.6300 644.3034 651.4315 680.8799 717.4398 737.1195 740.9674 753.4996 759.8788 763.5763 776.4957 785.2431 801.0828 817.7512 855.0555 859.1353 865.7442 872.9181 905.3790 926.4722 938.9554 945.4770 954.1027 979.8175 982.7787 988.9769 1008.4667 1013.7774 1026.6317 1033.6871 1065.2026 1070.1328 1091.8213 1115.6950 1124.4299 1131.5642 1162.2522 1162.8706 1173.1290 1176.0780 1191.9011 1197.9140 1223.1639 1234.9217 1249.3280 1268.2109 1274.6979 1279.3270 1298.6702 1332.7444 1370.5771 1375.9415 1376.2763 1393.8412 1396.0570 1397.3792 1411.9877 1434.7548 1456.5800 1460.2740 1470.2498 1471.5626 1472.7154 1474.6813 1476.8674 1481.6403 1484.3686 1488.7262 1503.7349 1583.3023 1596.5154 1614.0570 1619.1544 1620.0315 2979.8849 2990.7233 2994.8416 2996.1803 3009.9922 3057.8094 3079.7365 3085.4038 3087.0490 3092.5879 3105.4762 3115.1799 3136.7700 3138.2715 3151.4390 3155.4108 3167.4494 3171.4682 3179.7238 3181.1642 3516.0125
redmass: 5.0652 6.4444 6.0710 4.8052 6.5791 3.1477 5.0458 2.5362 3.9104 3.9282 3.6982 3.5996 2.9267 3.9292 5.1434 1.4042 1.1686 3.7915 4.0652 2.9235 2.5338 1.4546 4.5901 3.2626 4.6396 3.1145 3.3349 4.7606 4.6531 3.6786 4.3887 5.1140 3.1982 2.3627 3.7566 3.0191 3.1095 4.3910 6.4128 4.8079 4.9878 3.3946 3.7954 4.6396 3.5197 1.3817 1.2865 4.1940 4.8238 5.8754 1.9683 5.8038 1.5029 1.4180 2.7156 2.7569 2.2585 1.5414 1.4129 1.3737 2.2380 1.4125 1.3123 2.1147 1.3910 2.1313 2.2345 2.9057 3.1177 1.9598 2.2105 1.7779 1.6058 1.9137 1.6262 1.4233 1.9878 2.1830 2.2308 1.9298 1.3874 2.8509 1.7005 1.5021 1.8007 1.3310 1.4626 3.0057 5.8319 1.2962 1.2110 1.2207 3.3322 5.5644 2.3094 1.1928 2.0755 1.4054 1.9108 2.5148 1.2344 1.0563 1.1612 1.0912 1.4078 1.0672 6.4404 7.3923 7.2933 7.3035 6.9380 1.0361 1.0359 1.0826 1.0361 1.0625 1.0991 1.0991 1.1014 1.0997 1.0990 1.1001 1.1009 1.0864 1.0860 1.0913 1.0913 1.0977 1.0941 1.0993 1.0978 1.0776
irintensity: 0.4270 0.2983 2.0788 1.4344 2.3436 1.1449 8.7642 0.9401 3.4256 0.7279 1.8249 2.4465 1.8399 0.5280 0.1744 0.5440 0.3704 0.5176 2.5923 3.2571 3.3748 1.7974 5.9265 2.6461 0.8671 0.2265 3.4017 2.6074 8.0600 6.2743 12.1861 2.5052 10.6590 56.7155 6.5606 9.0410 20.7901 23.3897 3.3830 2.2170 0.9361 8.3727 12.2189 11.1036 10.6192 154.9311 17.7037 27.1610 15.9442 12.3098 8.3876 2.3535 1.3698 0.4815 1.7501 10.5345 1.3259 1.6391 3.4025 4.2069 1.8295 0.7070 0.1267 8.9042 0.2624 6.0359 11.7994 2.4392 19.2688 6.7853 5.9929 6.2228 3.0004 16.6720 2.4543 14.2259 12.4012 12.9102 12.2306 51.2207 14.9582 29.9526 26.8857 3.0586 53.7994 4.8785 6.7169 32.5724 11.3998 27.8517 45.9881 11.6179 7.7951 8.9147 48.9299 59.2740 4.3518 34.1674 36.9570 18.8454 13.3384 10.8619 21.4384 11.5118 107.3818 7.8882 6.6082 0.7869 47.5285 41.9363 43.4453 31.5303 16.7420 9.7711 34.1343 14.2258 0.9992 36.2288 59.3252 1.7492 49.8176 17.6017 8.6813 5.1092 2.3157 7.0406 15.3379 9.4451 9.9746 8.0225 10.2619 19.9336
temp: 298.150 k
press: 1.00000 atm
elementType: 9 8 8 7 7 6 6 6 6 6 6 6 6 6 6 6 6 6 6 6 6 6 6 6 6 1 1 1 1 1 1 1 1 1 1 1 1 1 1 1 1 1 1 1 1 1
symmnumber: 1
zpe: 961053.5 jmol-1
zpe.correction: 0.366046 hartree
zpe.thermalcorrener: 0.389374 hartree
zpe.thermalcorrenthalpy: 0.390319 hartree
zpe.thermalcorrgfe: 0.311724 hartree
zpe.sumelectzpe: -1132.698623 hartree
zpe.sumelectthermal: -1132.675294 hartree
zpe.sumelectthermalent: -1132.674350 hartree
zpe.sumelectthermalfe: -1132.752945 hartree
dipole: -2.7435 1.2789 -1.1681
dipole: 3.2445
quadrupole: -142.8973 -127.4777 -152.9962
quadrupole: 4.6501 -6.2441 -6.3684
quadrupole: -1.7736 13.6461 -11.8725 4.6501 -6.2441 -6.3684
hfenergy: -1133.0646688 hartree
pointgroup: C01 [X(C20H21F1N2O2)]
dipole: -1.1289564 -0.468817 0.3675176 debye
polarizability: 208.0024765|-10.4879746|258.2662723|-28.1803304|-17.6354443|194.2399922 unknown
InChI: InChI=1S/C20H21FN2O2/c1-4-13(18-14-9-5-8-12-17(14)25-23-18)19(24)22-20(2,3)15-10-6-7-11-16(15)21/h5-13,22H,4H2,1-3H3
charge 0 multiplicity 1
46 atoms
F  -0.803293 -0.843395 -1.833001
O  3.132601 -0.592958 -1.634407
O  -0.704939 1.721192 1.561548
N  -0.90007 1.787364 -0.767416
N  2.637969 0.800154 -1.448705
C  -2.348435 1.422236 -0.866669
C  1.338247 2.092493 0.205945
C  -2.554647 -0.019035 -0.340455
C  -0.187072 1.855747 0.410907
C  1.99947 2.630301 1.504171
C  -2.727053 1.485801 -2.373452
C  -3.189794 2.469368 -0.096604
C  1.969054 0.805056 -0.277348
C  1.964016 -0.501124 0.357544
C  3.481164 3.007116 1.304811
C  -1.790976 -1.099452 -0.842827
C  -3.515907 -0.355444 0.64513
C  2.702696 -1.333827 -0.524178
C  1.403008 -1.045405 1.541008
C  -1.933001 -2.430331 -0.427942
C  -3.697304 -1.685721 1.08576
C  2.938658 -2.699014 -0.284353
C  -2.906711 -2.727435 0.551414
C  1.627427 -2.41136 1.801543
C  2.386402 -3.222158 0.904811
H  1.475618 2.844205 -0.597141
H  -0.36631 1.774505 -1.64102
H  1.420912 3.512242 1.836706
H  1.893523 1.877059 2.304763
H  -2.58353 2.512855 -2.756063
H  -2.119861 0.789664 -2.976786
H  -3.788331 1.215028 -2.501994
H  -2.969553 3.470921 -0.504653
H  -2.942397 2.469037 0.976348
H  -4.269055 2.276926 -0.229794
H  3.912611 3.393088 2.245925
H  3.597095 3.790128 0.532116
H  4.083258 2.13662 0.987775
H  -4.1212 0.438551 1.089961
H  0.798493 -0.427569 2.212251
H  -1.291442 -3.202567 -0.862327
H  -4.448226 -1.904587 1.852087
H  3.51388 -3.315168 -0.980105
H  -3.038699 -3.759498 0.892338
H  1.208465 -2.865293 2.70556
H  2.542338 -4.28031 1.142516
