program: Gaussian 09
title: 000178950
version: EM64L-G09RevD.01
frameworkgroup: C1[X(C14H12FNS)]
method: RPBEPBE
basis: SDD
operation: Freq
keyword: #p
keyword: freq=noraman
keyword: PBEPBE/SDD
title: #p freq=noraman PBEPBE/SDD
converged: YES YES NO NO
title: Mulliken charges:
elementType: S F N C C C C C C C C C C C C C C H H H H H H H H H H H H
charge: 0.156114 -0.213137 -0.681816 -0.695864 0.328505 0.215484 0.311828 0.196495 -0.676970 -0.406295 -0.590419 -0.363858 0.597615 -0.428770 0.341213 -0.390058 -0.838568 0.262423 0.248395 0.236671 0.268061 0.241335 0.219346 0.251114 0.316796 0.303237 0.271687 0.252253 0.267181
chargesum: 0.00000
title: Mulliken charges with hydrogens summed into heavy atoms:
elementType: S F N C C C C C C C C C C C C C C
charge: 0.156114 -0.213137 -0.061783 -0.185046 0.328505 0.215484 0.311828 0.196495 -0.676970 -0.169624 -0.322358 -0.122523 0.597615 -0.209424 0.341213 -0.138944 -0.047446
polarizability: 2.87816064e+02 3.81444259e+00 1.85458476e+02 -8.27620671e-01 4.05256602e+00 8.84547219e+01
1716.lowfreq: -6.8710 -0.0008 0.0011 0.0011 1.7368 4.2948 29.3081 60.4231 77.0508
frequency: 29.0364 60.4155 77.0457 117.4924 130.3209 135.4416 149.4388 219.9620 229.4981 245.7462 295.4146 315.2505 324.0952 381.4151 390.7848 393.4599 430.2836 456.7747 501.6698 513.7390 534.6718 537.9150 547.2761 588.8703 615.0092 620.1587 633.5201 714.9382 728.4671 755.7334 762.5780 796.0477 814.8671 822.4633 863.8551 917.2905 936.5498 942.9621 950.0993 951.5993 966.0236 984.7728 1010.8649 1060.4143 1094.9240 1122.9305 1129.8204 1134.1214 1179.6826 1198.4213 1215.6773 1266.0317 1299.7442 1332.6463 1337.5881 1372.2577 1378.6208 1422.7610 1436.9721 1443.0962 1449.5207 1460.2699 1468.0402 1485.3348 1576.6642 1596.6049 1602.1982 1621.8928 1626.9493 2993.3578 3011.0041 3037.0790 3119.4104 3135.5659 3137.3206 3139.6854 3144.4892 3160.5457 3174.2737 3504.5356 3676.3232
redmass: 3.2177 5.6877 4.2276 1.3020 3.3212 3.9951 4.3494 3.0863 7.4996 3.2991 4.6064 7.8081 4.2124 1.8956 6.9155 2.0001 2.8341 4.3415 3.3909 7.1927 2.6597 3.2601 1.3027 6.4766 3.4344 6.0927 6.1761 3.3923 5.7476 6.3081 3.9596 6.5433 1.4549 1.6156 1.4496 3.9416 1.5186 1.4846 2.3148 1.9816 1.1770 1.2962 6.7657 1.7981 1.8478 1.6787 1.1582 1.5080 1.7404 2.2617 2.0305 1.5085 2.3689 2.3402 1.3177 4.2459 6.3678 1.1418 4.8207 1.0594 3.9953 1.0851 3.9594 4.1964 5.0465 5.4571 1.6640 7.4006 3.9813 1.0617 1.0277 1.0985 1.0869 1.1056 1.1050 1.0900 1.0965 1.0931 1.0957 1.0479 1.1001
irintensity: 1.2304 0.1371 0.2299 0.3122 0.1708 0.3030 1.3843 0.3515 1.0984 12.0106 11.8090 3.5770 11.6161 75.3620 5.1794 69.3641 4.8162 2.3651 8.0157 23.9825 26.0789 7.2036 72.0931 7.6369 4.6258 2.1526 0.1958 1.9002 8.1862 3.4216 0.1555 2.5161 96.2782 3.2467 20.6767 27.3416 3.5299 1.1984 2.7961 6.2685 3.6065 23.8525 4.3476 11.2710 4.7085 49.1087 2.0155 15.2614 12.5736 1.5685 56.2233 9.1965 6.7452 23.5140 3.4111 40.1359 4.8408 16.8635 60.2328 22.1820 45.5735 8.0293 150.7579 0.4978 2.4628 37.5461 43.4088 4.2765 333.7465 9.2011 31.5886 4.8062 14.9860 10.0520 13.0454 3.7355 29.9061 3.5154 8.7101 86.9730 44.2405
temp: 298.150 k
press: 1.00000 atm
elementType: 16 9 7 6 6 6 6 6 6 6 6 6 6 6 6 6 6 1 1 1 1 1 1 1 1 1 1 1 1
symmnumber: 1
zpe: 579833.5 jmol-1
zpe.correction: 0.220847 hartree
zpe.thermalcorrener: 0.236056 hartree
zpe.thermalcorrenthalpy: 0.237000 hartree
zpe.thermalcorrgfe: 0.178044 hartree
zpe.sumelectzpe: -1092.180690 hartree
zpe.sumelectthermal: -1092.165481 hartree
zpe.sumelectthermalent: -1092.164537 hartree
zpe.sumelectthermalfe: -1092.223493 hartree
dipole: 4.6050 1.4319 1.1389
dipole: 4.9551
quadrupole: -103.6358 -92.9367 -109.8759
quadrupole: -1.0562 2.7409 -1.5638
quadrupole: -1.4864 9.2128 -7.7265 -1.0562 2.7409 -1.5638
hfenergy: -1092.4015366 hartree
pointgroup: C01 [X(C14H12F1N1S1)]
dipole: 1.8464715 -0.4091676 -0.4728978 debye
polarizability: 287.8015864|4.0338047|185.1135584|-0.5997145|7.1587274|88.8141169 unknown
InChI: InChI=1S/C14H12FNS/c1-17-14-12-7-8-6-9(15)2-3-10(8)11(12)4-5-13(14)16/h2-6H,7,16H2,1H3
charge 0 multiplicity 1
29 atoms
S  3.105076 2.007302 0.561819
F  -5.196343 0.83456 0.061183
N  4.403873 -0.749387 0.161861
C  -0.182281 1.452967 0.350531
C  0.841048 0.334228 0.194359
C  0.173328 -0.907548 -0.0389
C  -1.510326 0.72615 0.176625
C  -1.279069 -0.667434 -0.051443
C  2.241542 0.402558 0.252106
C  0.930028 -2.088024 -0.21247
C  -2.814571 1.245666 0.217943
C  -2.367385 -1.549585 -0.24055
C  3.015427 -0.796705 0.09341
C  2.334187 -2.031175 -0.14357
C  -3.873285 0.335599 0.024795
C  -3.686748 -1.04055 -0.202084
C  3.503044 2.489905 -1.232947
H  -0.099713 1.945124 1.338199
H  -0.040542 2.251809 -0.402877
H  0.43684 -3.049639 -0.394175
H  -3.025331 2.305181 0.391386
H  -2.204403 -2.618338 -0.415381
H  2.926129 -2.946012 -0.267611
H  -4.557339 -1.687586 -0.343445
H  4.845099 0.119795 0.465124
H  4.955491 -1.600296 0.104112
H  4.075618 1.682506 -1.713865
H  4.106441 3.41002 -1.184017
H  2.568369 2.676608 -1.781919
