program: Gaussian 09
title: 000178953
version: EM64L-G09RevD.01
frameworkgroup: C1[X(C15H15NOS)]
method: RPBEPBE
basis: SDD
operation: Freq
keyword: #p
keyword: freq=noraman
keyword: PBEPBE/SDD
title: #p freq=noraman PBEPBE/SDD
converged: YES YES NO NO
title: Mulliken charges:
elementType: S O N C C C C C C C C C C C C C C C H H H H H H H H H H H H H H H
charge: 0.150181 -0.267777 -0.683611 -0.705637 0.325442 0.315019 0.221436 0.185341 -0.678618 -0.414694 -0.588296 -0.377685 0.591173 -0.429033 0.326125 -0.369256 -0.840311 -0.536015 0.243945 0.257135 0.235823 0.253318 0.237376 0.216797 0.246888 0.314289 0.300243 0.266457 0.249748 0.272622 0.218602 0.243449 0.219522
chargesum: 0.00000
title: Mulliken charges with hydrogens summed into heavy atoms:
elementType: S O N C C C C C C C C C C C C C C C
charge: 0.150181 -0.267777 -0.069079 -0.204556 0.325442 0.315019 0.221436 0.185341 -0.678618 -0.178870 -0.334978 -0.140309 0.591173 -0.212236 0.326125 -0.122368 -0.051483 0.145558
polarizability: 3.24749328e+02 -7.99524545e+00 2.01891533e+02 2.11543554e-01 3.37810581e+00 9.93599582e+01
1716.lowfreq: -9.4770 -3.1779 -0.0022 -0.0018 -0.0013 2.8715 31.7713 52.3816 66.3345
frequency: 31.4506 52.3724 66.3338 98.8884 113.0073 135.2462 139.6198 148.9600 204.1316 210.8878 231.1554 237.9305 262.0772 298.1635 323.3612 365.7867 378.7320 392.7089 431.8614 438.8983 456.1686 498.9730 518.1851 535.2547 543.0176 548.9149 600.3164 616.0891 620.4232 633.5996 720.7671 724.5995 754.8371 763.8515 796.5851 817.1506 827.5507 848.0997 900.5986 938.2621 945.0267 949.4470 954.3679 964.7068 984.4561 991.1818 1015.2998 1061.3464 1099.0767 1112.0267 1128.1570 1133.9752 1146.2651 1157.4991 1180.0760 1205.4350 1229.4314 1281.2257 1302.8524 1330.1202 1335.2943 1373.3512 1374.1054 1422.8765 1426.5410 1443.4971 1447.4451 1451.5639 1461.1131 1466.0493 1468.3709 1476.1606 1486.8313 1577.0238 1591.0229 1603.0848 1622.7296 1626.8764 2953.8691 2989.1339 3009.9281 3032.1397 3039.2051 3118.3009 3120.2483 3132.2976 3134.4868 3136.1820 3143.8291 3147.0430 3166.3050 3505.2298 3676.5782
redmass: 3.1407 4.1429 3.8339 3.6682 4.5623 1.3504 2.3912 3.8161 2.0968 3.7891 5.1873 2.0778 1.8937 3.8403 3.8104 6.7878 1.4354 2.9465 2.8013 4.7590 4.2871 3.1404 5.1302 1.2673 3.9314 2.6586 5.7898 5.8675 3.5262 5.6250 3.3330 5.7024 6.0144 4.0795 6.7220 1.5380 1.5257 1.4777 4.2963 1.7458 1.5898 2.6329 1.5030 1.1821 1.3060 4.8832 5.8904 1.7705 2.0705 1.2612 1.1460 1.6486 1.4502 1.4588 1.7840 1.7475 2.5460 1.5308 2.3809 2.3478 1.3370 6.6189 4.2049 1.2009 1.6159 1.0595 3.3014 2.4635 1.0891 1.0520 2.1909 1.3357 3.3504 5.3447 6.3451 1.5869 7.0755 3.7837 1.0332 1.0616 1.0277 1.0986 1.1037 1.0868 1.0989 1.0891 1.1055 1.1050 1.0965 1.0910 1.0954 1.0479 1.1000
irintensity: 2.0195 1.3208 0.8706 2.1346 2.4387 1.1629 0.4746 2.4636 0.4984 0.3613 2.3798 7.6129 8.1990 9.2870 11.9038 3.2187 117.6716 33.2704 3.6693 4.4404 5.2006 11.9498 31.7747 88.4785 2.2514 7.3408 11.4873 0.3954 3.5462 0.3186 2.8872 4.8557 0.3171 0.3491 1.6271 84.5767 12.9631 20.2433 8.0386 4.1888 3.3898 0.8878 1.6278 3.2731 22.4036 42.4361 28.8183 10.6933 11.2497 0.2463 0.3077 67.9195 35.9906 18.8959 12.6219 1.1790 161.5136 37.6489 44.3009 14.4497 3.7751 0.9512 31.0840 28.8578 59.5742 20.6425 35.7578 2.1178 10.5462 13.9671 245.7081 3.6283 5.4199 3.0348 18.2325 60.1582 43.8174 304.0831 78.7536 11.8759 33.4772 5.5420 53.3254 19.5959 31.4239 8.3529 10.3393 13.8726 30.3595 10.6419 13.7998 81.4960 41.7939
temp: 298.150 k
press: 1.00000 atm
elementType: 16 8 7 6 6 6 6 6 6 6 6 6 6 6 6 6 6 6 1 1 1 1 1 1 1 1 1 1 1 1 1 1 1
symmnumber: 1
zpe: 683997.8 jmol-1
zpe.correction: 0.260521 hartree
zpe.thermalcorrener: 0.277521 hartree
zpe.thermalcorrenthalpy: 0.278465 hartree
zpe.thermalcorrgfe: 0.215666 hartree
zpe.sumelectzpe: -1107.359993 hartree
zpe.sumelectthermal: -1107.342993 hartree
zpe.sumelectthermalent: -1107.342049 hartree
zpe.sumelectthermalfe: -1107.404848 hartree
dipole: -2.1271 -1.2567 0.8474
dipole: 2.6119
quadrupole: -93.7287 -98.8457 -117.9570
quadrupole: -13.4630 -3.9730 -1.8214
quadrupole: 9.7818 4.6647 -14.4465 -13.4630 -3.9730 -1.8214
hfenergy: -1107.6205141 hartree
pointgroup: C01 [X(C15H15N1O1S1)]
dipole: -0.8074 -0.5462729 0.3250301 debye
polarizability: 325.2359275|-1.4779137|201.1394298|-1.6988058|6.1084762|99.625461 unknown
InChI: InChI=1S/C15H15NOS/c1-17-10-3-4-11-9(7-10)8-13-12(11)5-6-14(16)15(13)18-2/h3-7H,8,16H2,1-2H3
charge 0 multiplicity 1
33 atoms
S  -3.264052 -2.181141 -0.538429
O  4.967673 -0.234435 0.021028
N  -4.789513 0.46351 -0.183285
C  -0.031893 -1.356681 -0.309218
C  -1.146536 -0.324377 -0.178265
C  1.231653 -0.519265 -0.137031
C  -0.583489 0.971201 0.040258
C  0.883526 0.848332 0.065761
C  -2.536582 -0.506777 -0.244687
C  -1.436026 2.087488 0.190983
C  2.574081 -0.938116 -0.161794
C  1.903049 1.813412 0.246437
C  -3.407789 0.626757 -0.108911
C  -2.831451 1.914822 0.113841
C  3.58673 0.041237 0.021926
C  3.251065 1.406407 0.223952
C  -3.670132 -2.656382 1.256548
C  5.378035 -1.622298 -0.189156
H  -0.117023 -2.152947 0.455793
H  -0.066724 -1.868797 -1.289889
H  -1.024122 3.088721 0.361337
H  2.822698 -1.992246 -0.320295
H  1.658984 2.870115 0.402556
H  -3.496988 2.780121 0.22065
H  4.066723 2.123265 0.359449
H  -5.153639 -0.438966 -0.491362
H  -5.406839 1.269547 -0.152983
H  -2.738009 -2.767293 1.829919
H  -4.208549 -3.616387 1.213885
H  -4.3072 -1.880431 1.707323
H  4.988237 -2.285388 0.608446
H  6.477451 -1.607136 -0.152105
H  5.044354 -1.998071 -1.176684
