program: Gaussian 09
title: 000178952
version: EM64L-G09RevD.01
frameworkgroup: C1[X(C14H12BrNS)]
method: RPBEPBE
basis: SDD
operation: Freq
keyword: #p
keyword: freq=noraman
keyword: PBEPBE/SDD
title: #p freq=noraman PBEPBE/SDD
converged: YES YES NO NO
title: Mulliken charges:
elementType: Br S N C C C C C C C C C C C C C C H H H H H H H H H H H H
charge: -0.010557 0.151829 -0.686883 -0.696878 0.336122 0.198649 0.265447 0.194689 -0.641475 -0.412632 -0.372320 -0.388345 0.631756 -0.475730 -0.217756 -0.192084 -0.840638 0.247110 0.247715 0.235393 0.260990 0.259463 0.244486 0.246600 0.304497 0.317602 0.252479 0.268621 0.271851
chargesum: 0.00000
title: Mulliken charges with hydrogens summed into heavy atoms:
elementType: Br S N C C C C C C C C C C C C C C
charge: -0.010557 0.151829 -0.064784 -0.202053 0.336122 0.198649 0.265447 0.194689 -0.406083 -0.151642 -0.112857 -0.143859 0.631756 -0.475730 -0.217756 0.054516 -0.047687
polarizability: 3.68021768e+02 -5.99739647e+00 1.82484314e+02 -1.86727869e+00 4.59010595e+00 9.22320603e+01
1716.lowfreq: -5.7869 -2.6322 -0.0016 -0.0009 0.0013 5.0776 38.0886 53.1179 75.9954
frequency: 38.0078 53.0004 75.9804 98.7399 115.4816 145.3582 159.4613 179.8149 208.8307 233.2422 246.5508 281.1629 300.0630 336.8616 379.4514 390.6583 406.5289 433.5615 447.3880 461.8539 523.4220 545.2800 568.1002 580.6866 626.8276 632.7853 638.8412 676.6635 725.0192 729.7178 752.5622 762.2570 824.9598 841.4730 851.3456 878.9847 904.3056 950.0320 959.6257 962.2061 969.6213 986.4564 1010.9378 1048.9190 1056.1852 1116.3097 1134.4192 1147.2435 1176.3911 1201.0594 1224.3738 1251.1554 1278.3230 1325.0344 1337.7914 1368.0431 1379.8084 1412.7813 1427.2659 1444.3299 1446.5245 1455.7043 1461.6193 1489.5953 1569.2674 1576.4324 1605.8047 1608.5477 1635.0805 2985.2796 3011.5827 3030.2579 3119.0444 3135.5894 3137.7179 3139.6659 3143.9886 3154.1319 3169.6108 3499.8797 3675.4579
redmass: 6.0890 3.6642 4.0791 8.9430 4.5729 1.0673 4.6848 9.8082 3.3105 3.1850 9.4992 4.5127 4.0620 5.8635 2.3333 5.2099 1.5336 3.1025 3.1133 5.0796 3.3590 3.5600 1.1482 4.7867 6.1871 6.7962 4.9254 6.7843 4.1210 5.3206 2.9148 5.5906 1.4807 5.0508 1.5271 1.4031 1.4690 1.5003 3.1017 1.9490 1.1897 1.2778 5.9154 1.6154 2.0189 2.0744 1.1444 2.0836 1.9171 1.7115 2.1327 1.3477 1.4021 4.6990 1.1337 6.9650 3.7008 3.1958 1.2154 1.1790 3.6817 2.9649 1.0762 4.3108 7.3659 7.5853 1.6334 3.6515 5.1506 1.0607 1.0277 1.0995 1.0917 1.1049 1.0896 1.1055 1.0922 1.0929 1.0958 1.0484 1.0998
irintensity: 0.5658 0.9133 0.1935 0.7793 0.9773 0.0929 0.2794 0.8642 4.9364 4.4887 2.8339 5.2396 0.6861 0.6798 27.3405 18.7989 141.0539 0.4701 5.1495 6.0734 6.1782 7.1471 92.4912 4.2970 2.9778 3.4600 7.4801 7.3090 1.3755 10.8674 0.0312 6.4339 50.3295 38.9163 29.8971 0.7543 8.0890 4.0746 2.7547 16.9705 3.0240 29.6287 0.1990 13.9455 19.2587 15.9766 0.0327 12.4947 17.9854 1.3112 1.3434 40.8631 0.0491 42.6716 1.5229 12.1544 28.3462 32.6250 18.9209 66.1551 85.4561 73.6651 22.4567 11.1137 4.9320 10.2557 93.3097 14.7748 318.4177 14.7221 33.6656 7.0513 21.5781 12.4292 8.1296 12.7385 2.4937 4.1477 7.2889 113.0837 42.6041
temp: 298.150 k
press: 1.00000 atm
elementType: 35 16 7 6 6 6 6 6 6 6 6 6 6 6 6 6 6 1 1 1 1 1 1 1 1 1 1 1 1
symmnumber: 1
zpe: 575848.3 jmol-1
zpe.correction: 0.219329 hartree
zpe.thermalcorrener: 0.235031 hartree
zpe.thermalcorrenthalpy: 0.235975 hartree
zpe.thermalcorrgfe: 0.175149 hartree
zpe.sumelectzpe: -1005.799023 hartree
zpe.sumelectthermal: -1005.783321 hartree
zpe.sumelectthermalent: -1005.782377 hartree
zpe.sumelectthermalfe: -1005.843203 hartree
dipole: -4.2909 2.2489 1.3199
dipole: 5.0211
quadrupole: -110.6477 -99.7886 -120.9665
quadrupole: -7.2520 -6.6472 -1.1905
quadrupole: -0.1801 10.6790 -10.4989 -7.2520 -6.6472 -1.1905
hfenergy: -1006.0183519 hartree
pointgroup: C01 [X(C14H12Br1N1S1)]
dipole: -1.7347316 0.7215388 0.6103351 debye
polarizability: 368.0343026|5.5516376|180.487764|-3.3493302|13.8297092|94.2160762 unknown
InChI: InChI=1S/C14H12BrNS/c1-17-14-7-12-9(6-13(14)16)4-8-5-10(15)2-3-11(8)12/h2-3,5-7H,4,16H2,1H3
charge 0 multiplicity 1
29 atoms
Br 6.033291 -0.065875 0.02074
S  -3.979574 -1.756069 -0.661218
N  -4.174986 1.227776 0.004017
C  0.850956 1.946399 0.356173
C  -0.456526 1.190849 0.139465
C  -0.181091 -0.176542 -0.175112
C  1.906799 0.868555 0.130731
C  1.276343 -0.376306 -0.182198
C  -1.76903 1.670253 0.204185
C  -1.249985 -1.067227 -0.412792
C  3.305623 0.976791 0.194789
C  2.061806 -1.523375 -0.434148
C  -2.860075 0.779513 -0.042586
C  -2.576977 -0.597623 -0.338894
C  4.069106 -0.185918 -0.061091
C  3.472477 -1.427106 -0.373027
C  -4.417386 -2.207687 1.132327
H  0.914791 2.378956 1.373743
H  0.964482 2.788285 -0.35452
H  -1.975489 2.722803 0.433851
H  -1.073877 -2.120855 -0.65358
H  3.796146 1.925249 0.433269
H  1.598247 -2.485475 -0.677444
H  4.097253 -2.30394 -0.56562
H  -4.386491 2.207109 0.170484
H  -4.91254 0.594795 -0.309302
H  -5.3134 -2.846551 1.086831
H  -4.630073 -1.291573 1.704094
H  -3.579221 -2.757407 1.584833
