program: Gaussian 09
title: 000178991
version: EM64L-G09RevD.01
frameworkgroup: C1[X(C21H23FN2O2)]
method: RPBEPBE
basis: SDD
operation: Freq
keyword: #p
keyword: freq=noraman
keyword: PBEPBE/SDD
title: #p freq=noraman PBEPBE/SDD
converged: YES YES NO NO
title: Mulliken charges:
elementType: F O O N N C C C C C C C C C C C C C C C C C C C C C H H H H H H H H H H H H H H H H H H H H H H H
charge: -0.209717 -0.249896 -0.222574 -0.439063 -0.055153 0.210673 -0.396296 -0.316389 0.516731 -0.786001 0.192691 -0.381475 0.170159 -0.734925 -0.338133 -0.379191 0.073026 -0.694382 0.185749 -0.393829 -0.396085 -0.331269 0.317464 -0.371209 -0.270839 -0.193442 0.260600 0.191904 0.234667 0.319345 0.237567 0.222491 0.242694 0.221233 0.230894 0.224414 0.229207 0.209779 0.245065 0.243282 0.221128 0.211086 0.231262 0.255319 0.251355 0.281792 0.257747 0.234979 0.235565
chargesum: 0.00000
title: Mulliken charges with hydrogens summed into heavy atoms:
elementType: F O O N N C C C C C C C C C C C C C C C C C C C C C
charge: -0.209717 -0.249896 -0.222574 -0.119718 -0.055153 0.210673 0.056208 -0.081722 0.516731 -0.083248 0.192691 0.070652 0.170159 -0.071524 -0.093068 -0.135909 0.073026 -0.030907 0.185749 -0.138510 -0.144730 -0.049477 0.317464 -0.113462 -0.035860 0.042123
polarizability: 2.25067768e+02 1.51549206e+01 2.81341850e+02 2.70762947e+01 -1.21175323e+01 1.95819047e+02
1716.lowfreq: -8.9755 -4.2103 0.0005 0.0006 0.0007 6.1188 8.9929 16.7411 32.6173
frequency: 6.7566 16.6249 32.5338 36.8167 48.3318 60.0102 71.6156 85.7203 112.1035 116.8377 118.6224 142.4755 166.8025 180.4025 207.8151 216.6983 222.2437 228.7251 266.0336 272.1969 279.2622 292.9045 308.1158 337.8607 345.2625 367.6018 383.4125 411.3240 421.7764 431.2078 439.4304 456.3626 490.0495 505.1105 537.9546 546.7446 550.9634 556.1769 578.6458 629.5781 643.2014 652.0383 672.6378 720.0090 729.1473 739.5006 752.6681 762.7907 776.3888 788.3174 791.9011 810.5935 815.0033 817.5014 831.7802 854.5713 865.4278 868.8439 900.5834 909.0087 940.0115 957.1028 959.3156 961.7193 992.5457 999.1125 1006.5563 1009.1718 1016.9069 1029.1314 1055.5255 1067.0432 1091.0213 1092.4822 1108.1419 1119.1084 1132.0077 1157.6955 1163.6898 1167.8184 1181.3279 1197.2050 1205.5344 1211.1943 1224.1839 1234.7518 1269.8825 1277.3670 1293.0657 1301.8855 1305.2280 1333.8939 1338.9465 1371.1959 1372.4646 1389.0101 1394.4450 1396.0717 1396.3689 1402.9477 1411.6011 1459.1815 1460.2037 1469.2984 1471.0787 1472.7820 1475.8587 1476.2608 1477.5553 1484.2962 1485.9228 1487.4303 1495.2374 1595.4533 1601.9487 1611.4421 1614.1408 1621.2914 2980.3818 2982.6590 2985.5278 2990.1486 2993.8261 3007.7627 3055.6335 3057.2666 3075.4394 3079.4703 3080.4852 3084.6617 3085.4341 3098.0223 3137.4574 3140.4750 3156.4774 3160.8170 3172.1178 3172.7985 3181.3664 3182.8548 3520.5485
redmass: 5.0574 6.7524 5.5568 4.5567 4.5901 3.2326 3.0749 4.9374 3.8065 2.6812 2.2942 2.8449 3.4799 3.2778 2.2594 4.7891 1.3322 1.5082 3.3794 2.3531 2.0374 4.4087 4.5050 4.3468 3.5883 3.3721 4.8857 2.9375 4.4211 3.5880 3.7299 5.0229 4.6671 4.1465 2.4229 4.1062 2.5490 1.9428 4.2294 7.1783 5.8153 5.0538 3.6598 3.4527 3.3470 4.5896 3.5747 1.4517 3.6577 2.4164 3.0321 2.0799 1.3736 1.9526 1.6543 6.5040 2.7865 1.3864 2.1642 2.6491 1.3766 1.4305 1.3813 2.0107 1.3150 2.1613 2.5301 2.1328 1.6955 2.0966 1.9663 2.8508 2.1620 2.1721 1.4086 2.3981 1.6066 1.5532 1.4546 2.4124 2.3053 2.1101 2.0776 2.3459 2.7666 1.3809 1.8261 1.4963 1.2709 1.3109 1.2524 1.4565 1.4428 4.1628 4.0581 1.2267 1.2193 1.2124 3.2933 3.6180 5.5872 2.2460 1.1645 1.1605 1.2048 2.6422 1.1261 1.2035 1.1166 1.1053 1.1745 1.0936 2.2688 7.3684 7.6437 6.5782 7.3946 6.6883 1.0361 1.0361 1.0361 1.0827 1.0616 1.0627 1.0991 1.0990 1.0997 1.0987 1.0990 1.1012 1.1010 1.0990 1.0891 1.0868 1.0909 1.0879 1.0957 1.0970 1.0963 1.0983 1.0778
irintensity: 1.6380 0.1589 2.6885 0.9452 0.8468 0.6655 0.0705 7.7647 0.8018 3.2493 0.3318 0.5759 2.8412 2.5422 0.6187 0.0415 1.2953 0.0120 1.5340 1.2004 1.1241 0.5490 5.8853 4.7266 0.5958 0.1767 1.8970 0.0507 0.3470 4.9162 1.2409 5.4281 15.1908 2.6115 22.5536 0.1785 28.3779 88.1990 1.7324 0.2060 3.1060 0.8948 2.3429 3.6875 4.5400 17.3107 6.1657 84.1612 38.1947 25.8262 11.4653 10.2483 4.0945 10.6449 58.6808 2.2306 3.6397 0.2839 7.1608 5.3143 0.4988 2.9419 1.0441 1.0573 0.2364 4.1315 11.5526 8.7901 12.1883 7.0783 7.2294 2.3653 4.8361 14.2873 11.1850 4.3729 3.1745 40.9872 1.5472 13.5092 1.3907 16.0196 34.5541 24.2671 58.4197 10.7516 46.6348 18.3302 3.9572 4.0029 2.8110 5.6518 12.0258 25.2958 12.4743 18.1342 41.9515 12.7774 4.5646 1.7927 9.1574 14.0982 34.2986 90.2317 7.1126 6.7597 48.4928 19.5933 25.5792 12.8208 43.2238 24.4670 97.1319 0.7697 7.6716 19.7886 31.5823 89.9705 29.8290 15.5342 42.3375 12.8665 24.7119 15.5671 1.1414 0.5311 43.1225 18.1963 37.6370 66.6508 42.2198 22.1213 8.7312 5.0506 7.4266 5.5745 5.9149 5.6578 5.1006 9.6278 18.2264
temp: 298.150 k
press: 1.00000 atm
elementType: 9 8 8 7 7 6 6 6 6 6 6 6 6 6 6 6 6 6 6 6 6 6 6 6 6 6 1 1 1 1 1 1 1 1 1 1 1 1 1 1 1 1 1 1 1 1 1 1 1
symmnumber: 1
zpe: 1033912.8 jmol-1
zpe.correction: 0.393797 hartree
zpe.thermalcorrener: 0.418717 hartree
zpe.thermalcorrenthalpy: 0.419661 hartree
zpe.thermalcorrgfe: 0.336222 hartree
zpe.sumelectzpe: -1171.920271 hartree
zpe.sumelectthermal: -1171.895351 hartree
zpe.sumelectthermalent: -1171.894407 hartree
zpe.sumelectthermalfe: -1171.977846 hartree
dipole: -1.1178 -1.6348 0.3352
dipole: 2.0086
quadrupole: -151.3219 -147.8107 -157.8466
quadrupole: 16.0731 -8.4867 -0.7088
quadrupole: 1.0045 4.5157 -5.5202 16.0731 -8.4867 -0.7088
hfenergy: -1172.3140676 hartree
pointgroup: C01 [X(C21H23F1N2O2)]
dipole: 0.3729658 -0.6829037 -0.1379078 debye
polarizability: 227.3438561|-8.5257063|284.1147943|25.7253292|7.228268|190.7700151 unknown
InChI: InChI=1S/C21H23FN2O2/c1-4-16(19-17-8-6-7-9-18(17)26-24-19)20(25)23-21(3,5-2)14-10-12-15(22)13-11-14/h6-13,16,23H,4-5H2,1-3H3
charge 0 multiplicity 1
49 atoms
F  3.307278 3.988737 0.116723
O  0.457511 -1.279658 1.630893
O  -3.428592 0.502321 -1.787603
N  0.607089 -1.812354 -0.635663
N  -2.925315 -0.845892 -1.401317
C  2.075221 -1.579728 -0.800935
C  2.876562 -2.56572 0.110116
C  -1.619922 -1.879081 0.418369
C  2.406013 -0.095824 -0.490721
C  2.390095 -1.841491 -2.300867
C  -0.086804 -1.635624 0.542808
C  -2.245109 -2.198268 1.804042
C  -2.253679 -0.675433 -0.24331
C  2.498925 -4.051737 -0.054196
C  1.536493 0.92205 -0.963032
C  3.588303 0.293007 0.186337
C  -2.253359 0.710106 0.192942
C  -3.750417 -2.520504 1.721211
C  -3.000712 1.401006 -0.798056
C  1.823045 2.287988 -0.7655
C  3.900298 1.65593 0.393336
C  -1.69034 1.426063 1.281028
C  3.007587 2.624315 -0.089398
C  -3.242258 2.785847 -0.762059
C  -1.919543 2.814463 1.336816
C  -2.686397 3.480835 0.333719
H  2.719575 -2.263534 1.16098
H  3.952944 -2.443673 -0.117977
H  -1.792479 -2.744316 -0.253607
H  0.081182 -2.112549 -1.46043
H  1.833312 -1.141357 -2.949746
H  2.134264 -2.8763 -2.593489
H  3.465682 -1.686326 -2.488162
H  -1.693389 -3.055857 2.23296
H  -2.064341 -1.34898 2.486212
H  3.088706 -4.669309 0.646953
H  1.430948 -4.220177 0.171715
H  2.699045 -4.429035 -1.073709
H  0.608843 0.647588 -1.477131
H  4.276538 -0.459984 0.578259
H  -4.147636 -2.770998 2.72124
H  -3.943271 -3.381399 1.054006
H  -4.32897 -1.66299 1.332783
H  1.146648 3.072858 -1.116286
H  4.807802 1.961815 0.922006
H  -1.078994 0.917044 2.032289
H  -3.823804 3.290248 -1.537837
H  -1.496348 3.399693 2.159465
H  -2.843429 4.562186 0.412123
