program: Gaussian 09
title: 000178964
version: EM64L-G09RevD.01
frameworkgroup: C1[X(C14H19N3O3S)]
method: RPBEPBE
basis: SDD
operation: Freq
keyword: #p
keyword: freq=noraman
keyword: PBEPBE/SDD
title: #p freq=noraman PBEPBE/SDD
converged: YES YES NO NO
title: Mulliken charges:
elementType: S O O O N N N C C C C C C C C C C C C C C H H H H H H H H H H H H H H H H H H H
charge: 0.882576 -0.517282 -0.252968 -0.206963 -0.506925 -0.514243 -0.300035 0.318636 -0.350744 -0.710073 -0.725003 0.355544 -0.718606 0.214812 0.501263 -0.582279 -0.323884 -0.343519 -0.213765 -0.208245 -0.235550 0.193829 0.254020 0.270883 0.218617 0.212366 0.236949 0.238975 0.207974 0.220190 0.211064 0.228148 0.240329 0.243730 0.259607 0.250206 0.251238 0.232212 0.233089 0.233830
chargesum: 0.00000
title: Mulliken charges with hydrogens summed into heavy atoms:
elementType: S O O O N N N C C C C C C C C C C C C C C
charge: 0.882576 -0.517282 -0.252968 -0.206963 -0.506925 -0.514243 -0.300035 0.318636 0.097105 -0.008207 -0.041105 0.355544 -0.059205 0.214812 0.501263 0.161387 -0.073679 -0.092281 0.018447 0.024844 -0.001720
polarizability: 2.74479016e+02 2.20671441e+01 1.99461284e+02 -1.21730327e+00 1.08455280e+01 1.71964298e+02
1716.lowfreq: -11.1895 -4.6253 -2.0737 0.0007 0.0009 0.0010 21.2419 23.8207 42.0651
frequency: 20.8425 23.7750 42.0577 51.8312 62.7081 81.1048 94.3155 107.9368 119.6166 152.2524 165.4990 182.3404 185.3455 212.0960 225.0228 242.6226 251.0058 259.3655 273.0147 290.8659 296.6225 316.1314 339.6983 343.9948 359.8131 364.8324 392.9520 396.9470 404.1279 425.6973 488.5570 501.5924 510.0421 540.1578 608.5061 613.2497 660.4257 688.0552 712.5940 721.8883 744.5049 766.2858 787.2157 821.8485 833.8262 846.1133 858.9029 911.2755 916.0018 924.8510 940.1325 968.7877 971.6740 988.1564 992.6128 995.2750 1011.5362 1022.5458 1056.4714 1067.3996 1084.8644 1099.8022 1122.0610 1155.6014 1170.4984 1174.0983 1185.5982 1198.9160 1212.0898 1226.3859 1262.7700 1290.5965 1316.4629 1337.7897 1347.2955 1374.9965 1383.0734 1387.6916 1405.4948 1433.7899 1439.2841 1451.9720 1457.0295 1463.0717 1466.2560 1475.0564 1475.5966 1477.4072 1482.2904 1483.6021 1495.0861 1576.0440 1584.1603 1599.2119 1607.0672 2979.3134 2988.5233 2992.1738 3002.8509 3017.6957 3055.8884 3071.9547 3083.0161 3085.0370 3096.9061 3113.9487 3116.5131 3119.0946 3133.2801 3143.3595 3145.5934 3156.2549 3166.2510 3177.0077
redmass: 3.5911 5.0526 3.7950 4.4400 2.7374 4.8847 3.9055 1.0968 5.8290 3.7922 3.3804 5.7865 3.6606 1.2399 1.2644 4.3347 4.7362 3.8636 1.8476 6.0238 1.9695 5.5515 3.4324 3.8202 3.3361 4.5702 6.2373 3.9968 2.8948 5.9313 2.8598 3.8187 3.0761 7.2850 6.6748 6.5619 10.9796 1.9640 4.9855 6.8850 2.4780 1.9105 1.4476 5.5303 1.3062 4.3755 3.8657 3.8383 1.9635 2.3467 1.5566 2.0273 1.6297 5.7932 1.3041 1.3394 1.6028 2.2495 1.5059 2.2401 1.5636 4.6187 1.3912 4.2245 2.6025 1.0540 1.1363 2.6847 2.2371 2.5277 6.5521 1.3987 1.3313 1.4068 5.7198 1.1894 8.1997 1.2207 1.1963 1.1877 2.2869 1.0562 1.0862 1.0939 1.0482 2.2740 1.0594 1.0776 1.0519 1.0463 1.0581 7.4961 6.1661 6.6025 8.8281 1.0368 1.0497 1.0491 1.0378 1.0344 1.0965 1.0988 1.0994 1.0996 1.0992 1.1004 1.0993 1.0997 1.0852 1.0889 1.1037 1.0937 1.0974 1.1002
irintensity: 0.0791 0.4543 1.2408 0.5911 0.2295 2.1289 1.7024 0.0274 1.7878 3.6740 1.1162 1.1470 0.1343 0.1955 0.4960 0.0557 7.0895 1.9207 2.3128 21.0720 1.0699 6.0701 9.3433 1.3260 3.7747 16.1159 11.6084 8.0208 0.4381 12.2854 4.1929 23.2594 1.9986 14.7800 2.0398 2.6950 27.0647 30.6455 24.0262 15.5618 18.4334 36.4688 2.1721 2.4473 1.2928 1.5500 14.9168 36.1336 16.1488 27.3674 0.4453 40.6837 22.9549 2.6229 2.2659 0.0778 18.0523 2.4202 4.0683 2.5059 10.2040 42.2161 11.3642 20.1410 37.3718 0.0695 1.9770 106.8310 25.0121 13.2012 125.5439 25.3247 2.7488 8.0931 219.7498 24.6216 1.2769 27.8339 10.8893 103.9900 9.0983 2.8863 19.0379 37.6627 10.4717 34.6107 4.6373 7.1809 23.6189 8.8965 29.6466 238.3228 5.7036 68.2475 222.0233 22.5338 5.8998 39.7740 22.7201 26.6336 8.9543 49.0982 22.1676 32.0883 46.0304 13.0759 14.2245 8.8456 0.5865 7.1283 4.1624 23.3905 17.1241 9.6317
temp: 298.150 k
press: 1.00000 atm
elementType: 16 8 8 8 7 7 7 6 6 6 6 6 6 6 6 6 6 6 6 6 6 1 1 1 1 1 1 1 1 1 1 1 1 1 1 1 1 1 1 1
symmnumber: 1
zpe: 822448.2 jmol-1
zpe.correction: 0.313254 hartree
zpe.thermalcorrener: 0.335676 hartree
zpe.thermalcorrenthalpy: 0.336620 hartree
zpe.thermalcorrgfe: 0.260827 hartree
zpe.sumelectzpe: -1331.223071 hartree
zpe.sumelectthermal: -1331.200649 hartree
zpe.sumelectthermalent: -1331.199705 hartree
zpe.sumelectthermalfe: -1331.275497 hartree
dipole: 0.2830 -2.4589 -0.2347
dipole: 2.4862
quadrupole: -125.9083 -138.8497 -125.4469
quadrupole: 4.6734 -4.6450 -7.1533
quadrupole: 4.1600 -8.7814 4.6214 4.6734 -4.6450 -7.1533
hfenergy: -1331.5363247 hartree
pointgroup: C01 [X(C14H19N3O3S1)]
dipole: -0.1683427 -0.9635455 -0.0007999 debye
polarizability: 271.4209292|-26.1521264|204.1594491|-6.2893674|-7.0592195|170.3242198 unknown
InChI: InChI=1S/C14H19N3O3S/c1-5-14(2,3)17-13(19)15(4)12(18)16(21(17)20)11-9-7-6-8-10-11/h6-10H,5H2,1-4H3
charge 0 multiplicity 1
40 atoms
S  -0.435937 -0.451392 1.6052
O  0.147536 -1.956092 1.563694
O  -2.854276 1.832001 -0.442052
O  1.380911 2.871295 0.281366
N  -1.571058 -0.070348 0.085482
N  1.022439 0.630137 0.861225
N  -0.82377 2.129076 0.708506
C  -2.434872 -1.065324 -0.666458
C  -3.89009 -1.066597 -0.0939
C  -2.447779 -0.629206 -2.15906
C  -1.808109 -2.479686 -0.590365
C  -1.826642 1.301506 0.071315
C  -4.009622 -1.366036 1.414055
C  0.600177 1.924043 0.568873
C  2.155771 -0.024098 0.31018
C  -1.223475 3.549256 0.901459
C  2.465076 0.111391 -1.071948
C  2.95636 -0.850885 1.14075
C  3.587753 -0.551069 -1.603457
C  4.062216 -1.532679 0.590295
C  4.38465 -1.381705 -0.777627
H  -4.454977 -1.828799 -0.666998
H  -4.346957 -0.085713 -0.313439
H  -2.887645 0.37181 -2.285309
H  -1.42272 -0.632536 -2.570415
H  -3.052697 -1.35522 -2.732408
H  -0.764709 -2.479532 -0.948019
H  -1.813499 -2.909905 0.422331
H  -2.400714 -3.14052 -1.247458
H  -3.608134 -2.360547 1.679771
H  -3.480779 -0.605714 2.01976
H  -5.069996 -1.344138 1.72382
H  -0.547856 4.003193 1.641533
H  -2.262875 3.575022 1.259291
H  -1.156387 4.117278 -0.04151
H  1.846354 0.756668 -1.70385
H  2.714631 -0.94639 2.203074
H  3.83995 -0.426066 -2.662044
H  4.675986 -2.173615 1.231888
H  5.250864 -1.903665 -1.198351
