program: Gaussian 09
title: 000178948
version: EM64L-G09RevD.01
frameworkgroup: C1[X(C17H17NO2S)]
method: RPBEPBE
basis: SDD
operation: Freq
keyword: #p
keyword: freq=noraman
keyword: PBEPBE/SDD
title: #p freq=noraman PBEPBE/SDD
converged: YES YES NO NO
title: Mulliken charges:
elementType: S O O N C C C C C C C C C C C C C C C C C H H H H H H H H H H H H H H H H H
charge: 0.152472 -0.264538 -0.259588 -0.430383 -0.701231 0.356760 0.228524 0.319227 0.178798 -0.751796 -0.424361 -0.587774 -0.368634 0.586990 -0.369058 0.329126 -0.368172 -0.832009 0.203170 -0.535725 -0.798774 0.260861 0.241869 0.241858 0.255176 0.242522 0.310147 0.250524 0.314154 0.255558 0.268949 0.269766 0.220000 0.221070 0.246142 0.234989 0.265099 0.238293
chargesum: 0.00000
title: Mulliken charges with hydrogens summed into heavy atoms:
elementType: S O O N C C C C C C C C C C C C C C C C C
charge: 0.152472 -0.264538 -0.259588 -0.116229 -0.198500 0.356760 0.228524 0.319227 0.178798 -0.751796 -0.182504 -0.332598 -0.126113 0.586990 -0.058912 0.329126 -0.117648 -0.037736 0.203170 0.151487 -0.060393
polarizability: 3.96517679e+02 4.89664630e+00 2.24725282e+02 -2.40864245e-01 -4.99200583e+00 1.12888705e+02
1716.lowfreq: -82.6802 -6.4271 -2.5233 -0.0020 -0.0008 0.0010 4.6611 31.9488 33.2712
frequency: -82.6785 31.9234 33.2402 65.6671 73.4396 78.8888 88.4637 114.8311 123.8061 142.8698 149.3361 173.2739 203.3075 207.2105 232.7380 240.3978 256.9103 266.3155 308.6285 330.0937 396.2728 406.6134 432.6585 434.8243 452.9116 509.3517 511.0883 542.1246 547.4518 581.1969 590.4914 606.4976 625.8591 635.0631 671.9110 723.8282 734.7931 764.3854 765.4108 783.6284 798.2152 829.8375 847.6075 862.2769 888.0820 901.1857 942.7731 958.5010 962.8568 965.1671 984.6060 990.1223 990.2791 1010.0370 1018.5572 1030.2928 1100.1493 1113.0242 1125.6743 1135.7881 1147.3106 1157.0435 1177.8338 1203.3647 1228.2964 1232.5370 1279.6280 1288.1162 1299.7875 1338.4486 1362.4723 1371.8001 1376.2497 1407.3840 1423.9248 1433.1220 1443.1893 1444.4527 1451.1027 1454.3328 1459.1414 1466.5937 1467.0753 1472.2508 1479.7403 1520.7132 1577.9073 1591.2739 1613.2676 1622.2711 1626.7670 2956.8881 2987.5040 2988.0887 3012.4115 3031.5604 3043.6566 3072.6775 3123.5411 3134.7781 3135.6508 3137.2611 3138.6633 3138.6874 3148.9824 3169.4739 3188.5556 3387.9933
redmass: 1.0341 4.4546 3.5910 3.6456 3.6068 5.1919 5.1994 3.8247 1.1034 3.7532 4.3182 3.8369 4.3129 2.0590 5.7851 1.8178 3.9772 2.8877 4.8047 4.2790 4.8368 5.6759 2.9879 5.5569 4.2911 4.1305 4.5437 4.6501 3.4231 3.1422 5.3829 6.0898 3.5955 5.7238 6.0389 3.4192 5.6734 2.5975 5.3539 1.4197 5.9141 1.4486 1.4835 1.4929 4.1629 4.2255 2.2436 1.4094 2.6018 1.2269 1.2946 3.9016 1.4283 3.0714 3.1409 1.6579 2.0795 1.2600 1.1490 1.7350 1.4241 1.4583 1.9602 1.7142 2.9004 2.3655 1.9192 2.3580 2.4620 1.1452 5.7043 4.9203 1.2627 2.2917 1.3151 1.4897 1.0599 3.2476 1.4007 1.9896 1.0637 1.0515 1.0469 1.3438 1.9012 2.3326 6.4270 8.0949 8.0524 6.8203 5.2613 1.0331 1.0616 1.0383 1.0278 1.0982 1.1038 1.0982 1.0992 1.0897 1.0982 1.1054 1.0919 1.1037 1.0910 1.0955 1.0944 1.0766
irintensity: 0.2025 0.5578 1.9639 0.5073 0.3443 6.9737 1.5813 4.2020 0.7009 1.5650 10.8186 0.6856 0.4504 0.2350 0.5987 7.1578 2.7082 4.0580 0.5885 1.5770 0.8522 8.7707 7.6974 20.9467 2.6007 2.3611 1.8954 2.2246 2.4993 0.1116 2.7661 13.5638 0.6760 1.0517 7.1610 7.5969 5.5986 8.4323 1.2953 37.3369 1.9508 51.8991 38.9691 24.2781 0.7744 8.5345 9.6012 0.4604 54.3606 0.0067 20.0590 42.3351 5.2163 1.4090 24.8117 7.7306 32.6485 0.2184 0.4997 36.9397 30.6317 22.8738 9.7459 6.5787 64.9857 142.1568 79.4474 7.0926 177.2110 3.9528 168.2362 6.2438 75.2993 6.1266 48.7130 49.5795 14.5027 49.7967 22.3920 46.2117 10.7779 14.4277 19.7932 184.4358 114.4584 487.6698 6.1402 5.9129 64.1938 153.2171 86.2274 78.4549 10.5031 10.0837 27.8299 5.3678 50.4301 15.0706 30.6268 4.6723 9.9323 9.0969 13.5610 15.8022 11.8737 11.9099 6.1167 87.2112
temp: 298.150 k
press: 1.00000 atm
elementType: 16 8 8 7 6 6 6 6 6 6 6 6 6 6 6 6 6 6 6 6 6 1 1 1 1 1 1 1 1 1 1 1 1 1 1 1 1 1
symmnumber: 1
zpe: 780602.3 jmol-1
zpe.correction: 0.297316 hartree
zpe.thermalcorrener: 0.316927 hartree
zpe.thermalcorrenthalpy: 0.317871 hartree
zpe.thermalcorrgfe: 0.248340 hartree
zpe.sumelectzpe: -1259.793273 hartree
zpe.sumelectthermal: -1259.773661 hartree
zpe.sumelectthermalent: -1259.772717 hartree
zpe.sumelectthermalfe: -1259.842248 hartree
dipole: 1.1787 5.3279 0.5910
dipole: 5.4887
quadrupole: -117.7612 -125.6617 -133.2548
quadrupole: -6.1640 -1.3937 3.4747
quadrupole: 7.7980 -0.1024 -7.6956 -6.1640 -1.3937 3.4747
hfenergy: -1260.0905886 hartree
pointgroup: C01 [X(C17H17N1O2S1)]
dipole: -0.5099049 2.0893261 -0.1943399 debye
polarizability: 396.6440841|-1.1229807|224.3847504|-1.2851923|6.9415593|113.1028315 unknown
InChI: InChI=1S/C17H17NO2S/c1-10(19)18-16-7-6-14-13-5-4-12(20-2)8-11(13)9-15(14)17(16)21-3/h4-8,18H,9H2,1-3H3
charge 0 multiplicity 1
38 atoms
S  2.133969 2.613314 0.490568
O  -5.846666 -0.160576 0.003121
O  5.026642 -1.87171 -0.215758
N  3.929897 0.171046 0.182853
C  -0.988619 1.465943 0.287996
C  0.222042 0.549704 0.152159
C  -0.207771 -0.79741 -0.059594
C  -2.161588 0.503607 0.12937
C  -1.67966 -0.821811 -0.076077
C  1.587604 0.8628 0.210751
C  0.74934 -1.823865 -0.207486
C  -3.539132 0.784793 0.165034
C  -2.596005 -1.886486 -0.25035
C  2.560951 -0.184254 0.079397
C  2.124792 -1.52261 -0.13626
C  -4.447677 -0.293118 -0.010363
C  -3.976936 -1.618268 -0.217317
C  2.243234 3.193058 -1.314754
C  5.063053 -0.634125 0.052739
C  -6.399181 1.177495 0.218967
C  6.374554 0.123965 0.264863
H  -0.996083 1.98465 1.265788
H  -0.996875 2.261321 -0.482859
H  0.437784 -2.861109 -0.372733
H  -3.893468 1.807865 0.324812
H  -2.246152 -2.912311 -0.409604
H  2.882665 -2.300824 -0.242953
H  -4.717046 -2.413515 -0.347656
H  4.073463 1.164722 0.416236
H  2.601337 4.234178 -1.287395
H  1.246176 3.146725 -1.77679
H  2.950727 2.559553 -1.870322
H  -6.093037 1.875312 -0.585116
H  -6.092521 1.58703 1.201474
H  -7.490916 1.045245 0.197757
H  6.499642 0.926934 -0.485301
H  7.208992 -0.585091 0.167449
H  6.41317 0.586622 1.268457
