program: Gaussian 09
title: 000178941
version: EM64L-G09RevD.01
frameworkgroup: C1[X(C17H14)]
method: RPBEPBE
basis: SDD
operation: Freq
keyword: #p
keyword: freq=noraman
keyword: PBEPBE/SDD
title: #p freq=noraman PBEPBE/SDD
converged: NO YES NO YES
title: Mulliken charges:
elementType: C C C C C C C C C C C C C C C C C H H H H H H H H H H H H H H
charge: 0.095016 0.169570 0.299706 0.417429 0.256078 -0.443032 -0.472507 -0.374313 -0.441862 -0.833782 -0.389490 -0.389490 -0.257506 -0.247828 -0.224307 -0.224301 -0.244314 0.231757 0.235783 0.254670 0.237994 0.245118 0.224217 0.245129 0.248528 0.248530 0.225440 0.226488 0.226745 0.226745 0.227789
chargesum: 0.00000
title: Mulliken charges with hydrogens summed into heavy atoms:
elementType: C C C C C C C C C C C C C C C C C
charge: 0.095016 0.169570 0.299706 0.417429 0.256078 -0.211275 -0.236724 -0.119644 -0.203868 -0.119318 -0.140962 -0.140960 -0.032066 -0.021340 0.002438 0.002444 -0.016524
polarizability: 2.35078250e+02 -1.61638527e+00 1.94688967e+02 -2.14408539e-03 -2.04326104e-03 1.13997325e+02
1716.lowfreq: -31.5216 -5.0460 -0.0009 -0.0007 -0.0002 5.3784 6.2703 51.5452 66.2974
frequency: -30.9799 51.5409 66.2155 68.2633 113.6687 164.8281 217.9970 245.8790 252.1430 327.7524 341.3977 398.9158 417.6968 433.8827 451.7981 507.1462 520.5676 552.9132 572.6040 614.4956 618.4119 677.7871 678.6075 705.1077 714.4132 757.3992 768.8874 797.4338 822.6101 830.0028 857.1842 886.9008 898.4783 929.1857 958.6922 962.9049 975.6468 978.8473 988.2386 992.9454 996.0989 1015.4640 1027.8753 1036.3595 1041.0494 1075.6277 1117.9361 1160.6566 1171.4772 1172.4265 1185.1278 1215.3016 1236.4113 1262.2299 1276.9272 1306.9075 1352.2475 1366.2052 1397.6334 1399.9290 1411.1555 1427.8326 1427.9346 1459.5182 1464.2609 1473.3171 1485.6371 1516.9335 1575.7914 1581.6741 1599.8119 1611.5606 1629.3658 2979.9440 3057.3618 3085.4146 3115.7528 3118.7299 3120.4461 3125.1379 3130.6222 3137.5547 3140.9571 3146.7496 3147.5774 3162.1442 3162.7560
redmass: 2.5088 1.2399 3.9957 4.6563 3.1388 3.8962 4.3939 3.8885 3.7923 4.1603 3.5778 2.8296 4.2594 3.0256 4.1797 3.2498 6.8952 3.3447 3.4011 5.8746 6.5872 5.8262 4.0002 2.1349 3.0631 1.2643 2.1024 2.7847 5.0517 1.3357 1.2491 1.7327 2.8252 1.6154 1.3356 3.9418 1.3923 1.3857 6.2007 1.3292 1.3082 2.0969 2.1438 1.9014 1.5481 1.6009 2.0188 1.2630 1.0534 1.0974 1.1134 2.2780 1.7983 2.4413 1.8168 1.3853 3.5376 6.5464 1.2838 3.3471 2.6535 3.7975 2.2024 2.2745 1.0478 1.1805 2.5748 3.6190 7.2220 5.9798 6.1845 6.2720 6.7159 1.0369 1.0969 1.0995 1.0863 1.0860 1.0844 1.0877 1.0885 1.0924 1.0975 1.0967 1.0943 1.1003 1.1016
irintensity: 0.1610 0.7110 0.1296 0.3075 1.5220 0.5051 0.3632 0.5763 0.4035 1.6393 3.1270 0.0202 1.5152 8.2291 1.6341 0.0998 0.5070 7.5476 3.7403 0.2150 8.3184 1.3669 5.2238 36.3434 15.4227 29.3084 40.8172 14.5039 0.5202 61.7414 0.6355 7.0714 3.8227 1.4132 0.1655 2.8111 2.6877 0.4534 1.3952 0.2518 0.0650 6.7410 11.0375 5.1422 5.0752 11.1841 2.4146 2.1483 0.0124 2.4099 0.6571 3.4695 2.7830 4.6393 1.5369 0.3183 7.6667 0.0169 7.5434 18.4109 2.3990 0.2289 5.7245 0.3666 18.6366 12.6549 12.8143 18.1518 2.8263 1.4601 4.4697 5.5222 2.8525 29.6547 13.1927 27.7313 5.2688 2.8881 2.7024 0.0645 7.1571 16.8991 37.4490 37.8883 31.5393 32.5132 24.6619
temp: 298.150 k
press: 1.00000 atm
elementType: 6 6 6 6 6 6 6 6 6 6 6 6 6 6 6 6 6 1 1 1 1 1 1 1 1 1 1 1 1 1 1
symmnumber: 1
zpe: 659317.2 jmol-1
zpe.correction: 0.251121 hartree
zpe.thermalcorrener: 0.263997 hartree
zpe.thermalcorrenthalpy: 0.264942 hartree
zpe.thermalcorrgfe: 0.211326 hartree
zpe.sumelectzpe: -655.070707 hartree
zpe.sumelectthermal: -655.057830 hartree
zpe.sumelectthermalent: -655.056886 hartree
zpe.sumelectthermalfe: -655.110502 hartree
dipole: -0.5856 0.2699 0.0002
dipole: 0.6448
quadrupole: -87.8051 -92.5783 -99.0697
quadrupole: 2.4526 0.0000 -0.0003
quadrupole: 5.3459 0.5727 -5.9186 2.4526 0.0000 -0.0003
hfenergy: -655.3218279 hartree
pointgroup: C01 [X(C17H14)]
dipole: 0.2310936 -0.1046815 0.0000616 debye
polarizability: 235.0977867|-1.3502792|194.669431|0.0021306|0.0020573|113.9973245 unknown
InChI: InChI=1S/C17H14/c1-13-11-12-14-7-5-6-10-16(14)17(13)15-8-3-2-4-9-15/h2-12H,1H3
charge 0 multiplicity 1
31 atoms
C  0.052567 -0.608883 -0.000002
C  -1.096292 0.267988 -0.000005
C  -0.120562 -2.009082 -0.000016
C  -2.430843 -0.301297 -0.000023
C  1.438113 -0.023109 0.000054
C  -1.449999 -2.549421 -0.000031
C  -2.574419 -1.725347 -0.00003
C  -0.967802 1.699238 -0.000004
C  -3.569425 0.570717 -0.000024
C  1.06985 -2.955003 0.000063
C  2.106961 0.256199 1.220796
C  2.107154 0.256084 -1.220604
C  -2.095582 2.523644 -0.000023
C  -3.409905 1.957484 -0.000032
C  3.413145 0.796881 1.222227
C  3.413342 0.796756 -1.221876
C  4.071841 1.067263 0.000213
H  -1.571253 -3.639237 -0.000041
H  -3.58142 -2.159785 -0.000039
H  0.034215 2.140509 -0.000002
H  -4.572729 0.127267 -0.000032
H  1.71317 -2.797151 0.885353
H  0.739226 -4.007637 -0.000453
H  1.713853 -2.796469 -0.884597
H  1.59587 0.052527 2.169011
H  1.596218 0.052322 -2.168886
H  -1.975964 3.612923 -0.000035
H  -4.28613 2.615304 -0.000043
H  3.914101 1.007502 2.174064
H  3.914449 1.007285 -2.173654
H  5.084851 1.485328 0.000272
