program: Gaussian 09
title: 000178972
version: EM64L-G09RevD.01
frameworkgroup: C1[X(C19H19NO6)]
method: RPBEPBE
basis: SDD
operation: Freq
keyword: #p
keyword: freq=noraman
keyword: PBEPBE/SDD
title: #p freq=noraman PBEPBE/SDD
converged: YES YES NO NO
title: Mulliken charges:
elementType: O O O O O O N C C C C C C C C C C C C C C C C C C C H H H H H H H H H H H H H H H H H H H
charge: -0.278337 -0.264055 -0.286409 -0.269109 -0.207356 -0.222998 -0.458547 0.210877 0.501296 0.241617 0.126736 -0.483807 0.380575 -0.354510 -0.460237 -0.324074 0.342754 -0.381532 -0.328654 -0.373374 -0.244351 -0.685000 0.270679 0.253754 -0.749851 -0.746718 0.297418 0.333704 0.260316 0.224888 0.305977 0.262213 0.245496 0.249241 0.206085 0.207549 0.232274 0.206272 0.232750 0.246377 0.242097 0.279151 0.255218 0.248593 0.255012
chargesum: 0.00000
title: Mulliken charges with hydrogens summed into heavy atoms:
elementType: O O O O O O N C C C C C C C C C C C C C C C C C C C
charge: -0.278337 -0.264055 -0.286409 -0.269109 -0.207356 -0.222998 -0.124842 0.210877 0.501296 0.241617 0.126736 -0.186389 0.380575 -0.094193 -0.235350 -0.018096 0.342754 -0.119319 -0.083159 -0.124133 0.169283 -0.013704 0.270679 0.253754 0.017773 0.012104
polarizability: 3.75025668e+02 -7.51683850e+00 2.66256238e+02 6.38717931e+00 -2.08019445e+01 1.41308663e+02
1716.lowfreq: -5.1931 0.0005 0.0009 0.0010 2.1059 3.8436 17.4279 19.9084 29.8645
frequency: 17.2845 19.8755 29.8150 37.3866 40.2777 48.1229 56.0221 62.4742 82.1200 87.1109 93.8160 112.9334 119.2112 126.4463 136.7593 153.6217 164.8028 181.3510 224.5808 235.5102 243.8336 258.2181 298.1797 316.1514 343.7489 364.3437 372.7547 378.4320 400.5726 414.3695 419.6817 450.6450 472.2099 495.1104 522.7880 536.3404 543.9097 557.2283 586.8880 596.5201 627.1154 647.1557 654.9765 661.7117 702.3488 720.2731 723.4465 745.1432 770.8319 784.2623 800.5028 822.8197 832.9862 841.1170 850.1357 861.7327 871.7137 900.8957 902.9268 923.7068 933.5344 960.8544 982.1944 989.2078 995.4848 999.8268 1037.9313 1038.5232 1039.9418 1062.8503 1115.8342 1122.9635 1126.5808 1136.4381 1147.7162 1172.7579 1175.8670 1183.6215 1195.4894 1218.2827 1246.3756 1263.1878 1266.3692 1276.9802 1306.9357 1361.1714 1376.5797 1379.7820 1381.1044 1384.4701 1394.3876 1400.4919 1424.6900 1449.4383 1451.6531 1452.4158 1453.3676 1460.7230 1471.7124 1477.6413 1488.0829 1502.3913 1510.6908 1577.6342 1592.5824 1597.5673 1610.0017 1628.9824 1664.2019 1684.3010 2950.6158 2996.9134 3006.8595 3008.0269 3009.4690 3094.0563 3097.1170 3100.4135 3105.9526 3116.5959 3144.9722 3146.4147 3161.2834 3163.7859 3167.5240 3183.2005 3190.8359 3198.6531 3517.0136
redmass: 4.8085 4.7229 3.4870 2.2965 5.0274 5.2304 1.7814 3.5624 5.4674 4.0807 4.7688 4.7484 1.7394 1.0884 6.5319 5.4252 6.2097 6.4223 4.9948 6.0311 1.2803 4.1764 5.8321 5.0855 5.1620 5.2270 5.9156 5.1460 5.3504 3.0699 4.0101 4.5800 4.1264 4.5329 2.5288 3.5606 3.7456 3.6184 4.9524 4.8389 6.7593 2.4795 4.7592 1.8827 6.4369 5.3340 3.6739 5.0158 4.1350 5.4930 1.3433 4.7030 1.1104 1.7516 1.5139 5.8024 6.0729 1.6224 3.2479 1.3904 5.1452 1.3662 1.3209 2.0842 2.0245 2.7652 2.1186 2.0604 1.6475 3.3610 2.0987 1.3657 1.3781 1.4346 2.5793 3.3573 2.9279 1.3358 3.6629 2.4333 3.2094 1.1473 2.2335 1.5295 1.4285 1.9005 2.1820 1.5262 4.0049 1.3142 3.7856 1.2970 4.1255 1.0570 1.0609 1.0467 1.0525 1.0399 2.7876 1.0852 1.1845 1.9659 2.4104 7.7536 6.3833 5.4143 5.9373 6.4317 9.8957 10.4800 1.0553 1.0362 1.0376 1.1074 1.0369 1.0989 1.0972 1.0950 1.1013 1.0900 1.1022 1.1012 1.0906 1.0886 1.0933 1.0976 1.0924 1.0952 1.0766
irintensity: 3.2772 0.6912 0.6474 3.4847 0.6242 1.2437 1.7147 7.2488 2.7704 2.3217 0.7541 1.8983 2.8947 0.0801 0.2812 2.1734 4.3910 4.1314 3.3605 2.7385 1.4366 3.1533 0.1100 1.6840 5.3384 4.6646 2.9480 0.7631 3.5279 0.0066 6.5581 2.3960 5.5369 1.5835 28.3023 11.0756 29.4473 11.8948 11.7333 25.4454 0.1349 10.9174 2.0116 31.0738 10.8044 1.7390 0.3904 3.3011 1.6226 30.4488 41.9178 2.1521 0.6306 41.2952 55.2903 14.4663 134.7503 12.6427 53.8815 1.7485 20.3326 0.4430 1.8894 155.7458 89.9559 4.8378 78.8968 24.9625 9.8874 47.2627 3.6247 54.7628 21.1643 3.9541 722.8382 76.1999 186.1503 137.8714 11.9029 307.1970 43.8899 0.2448 33.3432 31.8253 4.5282 11.3296 108.2004 73.1932 19.8342 52.8566 28.1305 63.7161 5.5625 18.3008 27.4817 19.6070 27.4044 11.7809 100.6923 57.0644 84.6836 38.5381 428.6510 157.8176 40.5094 41.1914 14.2445 24.2722 138.0748 178.5576 44.5276 31.2314 0.6424 38.4424 0.8790 30.0637 5.3635 9.0620 34.3210 17.2886 8.6731 8.6060 5.3754 3.2096 14.8474 3.5155 0.1650 5.9659 16.8895
temp: 298.150 k
press: 1.00000 atm
elementType: 8 8 8 8 8 8 7 6 6 6 6 6 6 6 6 6 6 6 6 6 6 6 6 6 6 6 1 1 1 1 1 1 1 1 1 1 1 1 1 1 1 1 1 1 1
symmnumber: 1
zpe: 901857.3 jmol-1
zpe.correction: 0.343499 hartree
zpe.thermalcorrener: 0.369561 hartree
zpe.thermalcorrenthalpy: 0.370506 hartree
zpe.thermalcorrgfe: 0.283190 hartree
zpe.sumelectzpe: -1239.649557 hartree
zpe.sumelectthermal: -1239.623495 hartree
zpe.sumelectthermalent: -1239.622550 hartree
zpe.sumelectthermalfe: -1239.709866 hartree
dipole: -1.6669 -3.3382 1.1021
dipole: 3.8906
quadrupole: -113.0753 -129.4243 -158.6703
quadrupole: -1.0270 5.3144 -0.7938
quadrupole: 20.6480 4.2990 -24.9470 -1.0270 5.3144 -0.7938
hfenergy: -1239.993056 hartree
pointgroup: C01 [X(C19H19N1O6)]
dipole: -0.662176 -1.3243722 0.3880219 debye
polarizability: 374.1508635|-5.8674366|266.66344|16.5372022|-19.3679361|141.7762656 unknown
InChI: InChI=1S/C19H19NO6/c1-4-24-15-7-5-14(6-8-15)20-19(23)17-11-16(25-12(2)21)9-10-18(17)26-13(3)22/h5-11,20H,4H2,1-3H3
charge 0 multiplicity 1
45 atoms
O  -2.548842 2.989601 -0.075821
O  6.077389 -0.295364 0.043312
O  -4.240314 -2.38209 -0.387989
O  -0.042842 1.906546 -1.168907
O  -1.069849 2.784643 1.736107
O  -2.383183 -3.530052 0.499173
N  0.421697 0.01151 0.145629
C  -1.897762 0.591726 -0.283189
C  1.845736 -0.036711 0.108949
C  -2.873404 1.609795 -0.105459
C  -0.432869 0.912442 -0.477494
C  -2.333546 -0.755202 -0.371098
C  -3.704846 -1.062581 -0.262108
C  -4.244166 1.293018 -0.019677
C  2.487111 -1.034627 0.884682
C  2.638272 0.852987 -0.669838
C  4.675522 -0.27059 0.116064
C  -4.66876 -0.046661 -0.097751
C  3.891403 -1.158067 0.895451
C  4.037582 0.72817 -0.660662
C  6.787819 -1.313659 0.840508
C  8.278525 -1.123451 0.573794
C  -1.531327 3.469377 0.80722
C  -3.531683 -3.543287 0.014593
C  -1.152504 4.869763 0.409471
C  -4.397078 -4.755447 -0.237188
H  -1.609521 -1.551106 -0.552953
H  -0.023214 -0.668144 0.768471
H  -4.963295 2.105845 0.113864
H  1.886302 -1.727075 1.488391
H  2.148688 1.626772 -1.262828
H  -5.727433 -0.31314 -0.03668
H  4.352003 -1.939574 1.506071
H  4.660655 1.404155 -1.254266
H  6.450142 -2.32547 0.533505
H  6.550068 -1.173188 1.91554
H  8.5016 -1.255567 -0.498613
H  8.865121 -1.863291 1.148372
H  8.601159 -0.111633 0.872789
H  -2.042955 5.459792 0.139408
H  -0.593617 5.356498 1.221623
H  -0.509971 4.800291 -0.487529
H  -5.321885 -4.690914 0.362211
H  -3.844225 -5.666981 0.030231
H  -4.697906 -4.794162 -1.298177
