program: Gaussian 09
title: 000178940
version: EM64L-G09RevD.01
frameworkgroup: C1[X(C14H20O2)]
method: RPBEPBE
basis: SDD
operation: Freq
keyword: #pfreq=noraman
keyword: PBEPBE/SDD
title: #p freq=noraman PBEPBE/SDD
converged: YES YES NO NO
title: Mulliken charges:
elementType: O O C C C C C C C C C C C C C C H H H H H H H H H H H H H H H H H H H H
charge: -0.302053 -0.302034 0.361819 -0.470933 -0.586139 -0.570105 0.338266 0.330811 -0.758554 -0.759761 -0.567282 -0.546257 0.194245 0.190220 -0.530277 -0.530055 0.208975 0.206229 0.217070 0.218041 0.221993 0.229694 0.210459 0.238458 0.208681 0.215591 0.211025 0.211279 0.257021 0.254837 0.252642 0.220176 0.226552 0.226515 0.252612 0.220240
chargesum: 0.00000
title: Mulliken charges with hydrogens summed into heavy atoms:
elementType: O O C C C C C C C C C C C C C C
charge: -0.302053 -0.302034 0.361819 -0.055729 -0.151028 -0.118418 0.338266 0.330811 -0.100956 -0.121866 -0.310261 -0.291420 0.194245 0.190220 0.169092 0.169311
polarizability: 2.14171258e+02 1.54362982e+00 1.50872351e+02 -3.11850233e+00 5.03942616e+00 1.08716165e+02
1716.lowfreq: -5.6699 -0.0005 -0.0002 0.0005 5.8630 14.2868 47.0194 68.0960 80.8508
frequency: 46.6793 67.7382 80.8223 104.5164 143.6046 155.8035 160.5488 164.5205 196.0970 212.8350 231.7675 244.2643 263.1461 273.1428 279.9435 285.9365 348.2446 373.8097 381.2144 403.9697 430.9605 437.3868 493.4294 498.7342 546.5645 626.5671 642.8857 691.3156 710.4749 730.3666 738.8608 772.2863 859.2238 886.9975 891.0182 895.3121 919.8803 925.7082 934.9416 948.9714 957.8653 1001.2023 1015.1526 1033.7124 1082.8933 1113.3664 1114.4898 1134.8095 1145.7288 1148.3297 1152.9783 1159.4379 1168.3246 1189.0566 1211.9706 1236.0340 1272.6273 1275.2096 1290.7601 1297.9475 1329.6884 1350.3414 1368.8658 1374.6755 1389.3217 1395.2796 1423.0970 1443.2055 1446.5393 1455.6521 1456.5360 1458.5384 1460.2065 1469.9122 1474.3109 1477.6859 1480.2038 1487.2147 1487.8452 1492.2613 1571.0359 1616.3553 2947.2326 2961.0750 2964.2316 2966.8276 2967.8825 2969.5701 2972.4419 3006.1399 3014.7235 3030.2647 3056.4422 3059.0194 3063.7130 3063.8423 3065.4049 3074.9612 3117.1773 3117.4695 3132.5201 3135.9080
redmass: 3.2136 3.1985 3.0691 2.7001 2.8504 1.3846 1.0992 1.9214 1.7535 1.5433 1.7099 1.9895 2.6258 2.4926 3.2962 2.6424 2.8338 3.2861 2.2164 3.6757 3.1199 2.5998 3.9672 3.5693 4.5073 4.2002 4.3461 4.4358 4.4669 3.0973 3.3696 3.4995 1.7537 2.1991 1.5491 1.6793 3.0375 1.9767 1.4343 2.1160 3.9724 1.5566 1.8338 1.9613 3.6457 1.2417 1.2472 1.5811 1.9143 1.3453 1.3548 1.6314 1.4840 2.3415 1.6908 1.4439 2.9430 2.1638 2.0790 1.7912 1.5899 1.8626 4.4119 1.2187 1.7425 1.6914 1.1720 1.3691 1.1166 1.0901 1.0525 1.0627 1.0674 1.0621 1.0911 1.0550 1.0610 1.3624 1.3770 1.3082 7.3931 7.2807 1.0623 1.0367 1.0609 1.0539 1.0310 1.0313 1.0441 1.0971 1.0949 1.1027 1.0995 1.0994 1.1001 1.1020 1.1036 1.0987 1.1026 1.1027 1.0909 1.0917
irintensity: 0.9114 0.2852 5.1956 6.8023 4.5045 0.5048 0.0828 0.5078 2.5214 0.1531 2.6212 4.1702 5.2308 1.3575 0.8955 3.1080 0.5253 0.7908 1.2158 2.5567 7.7660 3.3936 1.0739 3.5790 3.7773 7.5830 3.8895 7.2878 2.0175 5.7728 2.9189 5.7677 4.9202 19.3448 5.4596 1.4045 17.5530 10.8817 1.0942 42.5964 60.6208 2.4079 1.8692 5.7979 64.2020 15.8688 1.1644 3.1371 5.3687 9.3182 1.8404 9.1104 27.1061 22.7854 25.8352 5.0697 86.6140 25.2984 20.8214 3.2948 4.1222 3.3991 5.0109 22.2521 20.4972 6.8023 0.2569 5.0225 7.0248 7.4972 14.2719 7.6745 1.3285 17.4379 17.1078 4.8671 8.6395 11.2228 93.6161 80.2510 0.0572 3.2558 29.0352 26.2004 34.1381 49.7311 103.2584 64.4893 27.8000 25.1489 27.4761 45.6340 22.5466 26.7231 26.7084 79.1549 22.7965 47.0258 26.5076 28.2424 13.2889 0.3770
temp: 298.150 k
press: 1.00000 atm
elementType: 8 8 6 6 6 6 6 6 6 6 6 6 6 6 6 6 1 1 1 1 1 1 1 1 1 1 1 1 1 1 1 1 1 1 1 1
symmnumber: 1
zpe: 805074.9 jmol-1
zpe.correction: 0.306637 hartree
zpe.thermalcorrener: 0.323387 hartree
zpe.thermalcorrenthalpy: 0.324331 hartree
zpe.thermalcorrgfe: 0.263474 hartree
zpe.sumelectzpe: -694.682907 hartree
zpe.sumelectthermal: -694.666157 hartree
zpe.sumelectthermalent: -694.665213 hartree
zpe.sumelectthermalfe: -694.726069 hartree
dipole: 0.4951 0.0901 -0.0057
dipole: 0.5033
quadrupole: -87.0959 -93.9397 -98.5851
quadrupole: 0.9744 0.1323 -4.0125
quadrupole: 6.1110 -0.7328 -5.3782 0.9744 0.1323 -4.0125
hfenergy: -694.9895436 hartree
pointgroup: C01 [X(C14H20O2)]
dipole: 0.1946421 -0.0362959 0.0016606 debye
polarizability: 214.115096|-1.9996316|150.2721149|3.7068032|7.112932|109.3725631 unknown
InChI: InChI=1S/C14H20O2/c1-14(2)6-5-10-7-12(15-3)13(16-4)8-11(10)9-14/h7-8H,5-6,9H2,1-4H3
charge 0 multiplicity 1
36 atoms
O  -2.878535 1.565631 0.429159
O  -3.167219 -1.206253 -0.491671
C  3.253048 0.271418 0.040466
C  3.054805 -1.255369 0.269032
C  2.051632 1.006105 0.70016
C  1.765844 -1.792938 -0.389414
C  0.686619 0.424423 0.340458
C  0.547214 -0.911936 -0.130762
C  3.318101 0.601419 -1.474061
C  4.568463 0.725693 0.718524
C  -0.475129 1.219463 0.501196
C  -0.750228 -1.420687 -0.385487
C  -1.761081 0.717196 0.225811
C  -1.903227 -0.635335 -0.19859
C  -3.647324 1.867462 -0.800101
C  -4.074302 -1.314428 0.673898
H  3.017456 -1.441236 1.362128
H  3.931786 -1.80794 -0.1228
H  2.080999 2.081723 0.434413
H  2.178817 0.959014 1.803058
H  1.564293 -2.823006 -0.036295
H  1.920905 -1.875688 -1.484969
H  4.102621 0.002802 -1.975157
H  2.357091 0.401261 -1.980199
H  3.558716 1.670642 -1.626542
H  5.445304 0.254074 0.23569
H  4.694297 1.823281 0.649106
H  4.581956 0.449548 1.790479
H  -0.395742 2.258979 0.840186
H  -0.886126 -2.45276 -0.729522
H  -4.012839 0.939407 -1.275907
H  -3.01634 2.430315 -1.514415
H  -4.491804 2.493436 -0.472865
H  -5.013081 -1.731901 0.278286
H  -4.251665 -0.323912 1.130682
H  -3.644825 -2.002102 1.427427
