program: Gaussian 09
title: 000178946
version: EM64L-G09RevD.01
frameworkgroup: C1[X(C16H14BrNOS)]
method: RPBEPBE
basis: SDD
operation: Freq
keyword: #p
keyword: freq=noraman
keyword: PBEPBE/SDD
title: #p freq=noraman PBEPBE/SDD
converged: YES YES NO NO
title: Mulliken charges:
elementType: Br S O N C C C C C C C C C C C C C C C C H H H H H H H H H H H H H H
charge: -0.000098 0.158653 -0.256228 -0.431337 0.369735 -0.693104 0.216493 0.279613 0.201843 -0.751101 -0.416045 0.588652 -0.371703 -0.382143 -0.367417 -0.219011 -0.191843 -0.830745 0.206909 -0.797500 0.266699 0.247393 0.243396 0.262824 0.247557 0.312595 0.249577 0.315932 0.269845 0.258258 0.269731 0.235482 0.266559 0.240529
chargesum: 0.00000
title: Mulliken charges with hydrogens summed into heavy atoms:
elementType: Br S O N C C C C C C C C C C C C C C C C
charge: -0.000098 0.158653 -0.256228 -0.115406 0.369735 -0.179012 0.216493 0.279613 0.201843 -0.751101 -0.172649 0.588652 -0.108879 -0.134586 -0.054823 -0.219011 0.057734 -0.032910 0.206909 -0.054930
polarizability: 4.13739743e+02 4.37616171e+00 2.16959493e+02 1.19493013e-01 -5.72517491e+00 1.04528203e+02
1716.lowfreq: -85.0877 -7.4234 -4.2150 -0.0009 -0.0007 0.0006 3.2789 27.9001 32.6304
frequency: -85.0787 27.8926 32.6041 67.9517 74.5323 74.9226 82.7410 123.7565 134.8521 142.5609 160.1641 188.2852 201.7090 209.6964 243.7573 262.2234 303.7381 316.5475 339.7084 379.4464 417.4900 428.2453 477.1618 511.9597 522.5697 528.1072 559.1688 579.9590 582.4766 619.6198 633.4793 667.6721 688.0480 716.9032 759.6554 763.3386 786.6750 797.9706 826.6540 845.8063 863.3581 874.5285 887.9010 946.2980 959.0013 963.6399 965.2210 984.9221 993.7095 1007.3062 1016.1186 1031.4017 1056.1288 1113.6138 1126.5535 1139.7626 1177.4819 1182.1377 1203.3560 1231.7638 1261.7200 1289.1867 1297.2595 1339.1317 1357.4452 1365.3952 1377.2602 1402.0119 1416.6330 1432.1271 1439.9197 1443.5913 1452.0293 1458.5869 1460.4387 1466.5673 1520.4287 1576.6209 1577.9942 1609.2375 1612.6955 1629.0799 2989.2081 2991.1513 3013.4748 3035.3119 3073.8394 3137.0907 3138.4225 3138.7614 3139.5541 3141.2070 3156.7756 3172.3461 3189.4705 3386.8138
redmass: 1.0293 6.2240 3.5847 3.9058 4.8775 5.9347 6.3684 1.1310 4.2802 4.3279 5.3999 7.7893 5.3312 4.6465 2.7575 8.4155 5.0270 4.9884 6.4503 4.5700 5.8601 2.8751 5.3070 3.7496 3.7857 4.3536 6.5625 3.2121 5.7562 3.5583 6.5713 6.2143 7.0026 3.5143 4.9779 2.7822 1.3648 5.4589 1.4572 5.0773 1.4916 1.4239 4.2084 1.9346 1.4983 2.1768 1.3439 1.2833 1.3390 4.4285 2.5773 1.6624 2.0719 2.2737 1.1496 1.5859 1.9104 2.2390 1.5245 2.6441 1.5313 2.8309 2.0456 1.1528 6.1191 4.5479 1.2508 2.9177 1.6465 1.8590 3.5043 1.0564 1.2714 1.0966 2.6843 1.0468 2.3026 8.0204 6.3791 7.8611 7.9169 5.1787 1.0383 1.0617 1.0279 1.0984 1.0982 1.0982 1.0905 1.1058 1.1046 1.0902 1.0929 1.0958 1.0945 1.0766
irintensity: 0.2275 0.1145 2.3211 0.3971 1.2950 4.3890 2.1644 0.5452 1.4054 4.7086 0.1576 5.2150 0.6595 0.7921 8.4475 2.4855 4.5289 8.6510 5.6657 0.0510 0.0260 6.6229 2.1927 5.4427 4.4565 1.0559 4.8872 0.2238 5.1714 0.8719 1.1371 2.9956 17.3600 5.9626 5.1137 7.8941 36.1949 3.5216 62.6366 38.8826 39.6175 0.3357 1.3017 6.9028 3.1391 47.8433 2.0507 21.9220 2.6086 10.7813 2.9373 7.9066 31.4779 9.8044 0.4405 11.4829 11.7371 9.7348 2.7753 94.0404 15.4053 11.0191 32.5386 12.6302 311.4852 9.8412 77.1511 1.4446 23.2233 64.3208 66.0193 20.7950 59.7351 14.5666 122.6889 19.8833 545.5254 15.3384 3.7739 24.8896 93.1824 100.2966 7.4714 8.3151 26.3636 4.3942 14.0868 10.1642 3.0611 9.0915 10.9312 13.8191 2.9534 7.1390 7.3382 86.0958
temp: 298.150 k
press: 1.00000 atm
elementType: 35 16 8 7 6 6 6 6 6 6 6 6 6 6 6 6 6 6 6 6 1 1 1 1 1 1 1 1 1 1 1 1 1 1
symmnumber: 1
zpe: 671661.5 jmol-1
zpe.correction: 0.255822 hartree
zpe.thermalcorrener: 0.274286 hartree
zpe.thermalcorrenthalpy: 0.275230 hartree
zpe.thermalcorrgfe: 0.206987 hartree
zpe.sumelectzpe: -1158.231625 hartree
zpe.sumelectthermal: -1158.213162 hartree
zpe.sumelectthermalent: -1158.212217 hartree
zpe.sumelectthermalfe: -1158.280461 hartree
dipole: -2.2529 3.3732 0.8536
dipole: 4.1452
quadrupole: -137.3255 -127.9561 -136.2451
quadrupole: -20.8091 -0.2031 3.5119
quadrupole: -3.4833 5.8861 -2.4028 -20.8091 -0.2031 3.5119
hfenergy: -1158.4874478 hartree
pointgroup: C01 [X(C16H14Br1N1O1S1)]
dipole: -0.8698829 1.3433008 0.313896 debye
polarizability: 413.7984804|2.1882298|216.6041129|-2.0085728|-8.0501326|104.8248457 unknown
InChI: InChI=1S/C16H14BrNOS/c1-9(19)18-15-6-5-13-12-4-3-11(17)7-10(12)8-14(13)16(15)20-2/h3-7,18H,8H2,1-2H3
charge 0 multiplicity 1
34 atoms
Br 6.664931 0.31976 -0.089797
S  -1.91924 2.590193 -0.518766
O  -4.640708 -1.990497 0.248158
N  -3.624412 0.089507 -0.169032
C  0.06569 0.597988 -0.17314
C  1.241236 1.55537 -0.328202
C  0.541376 -0.731357 0.047424
C  2.446745 0.636207 -0.168316
C  2.013422 -0.707019 0.052798
C  -1.310482 0.864038 -0.223708
C  -0.376689 -1.790048 0.212644
C  -2.24474 -0.215683 -0.074907
C  3.813839 0.957454 -0.213572
C  2.959909 -1.740007 0.229884
C  -1.76109 -1.537476 0.14976
C  4.742405 -0.093385 -0.032679
C  4.339235 -1.429579 0.187004
C  -2.029313 3.190713 1.279949
C  -4.727513 -0.757457 -0.025739
C  -6.066985 -0.050469 -0.232426
H  1.225263 2.063164 -1.311383
H  1.228934 2.359243 0.433245
H  -0.027759 -2.814147 0.384709
H  4.156736 1.982432 -0.383151
H  2.645753 -2.775321 0.399694
H  -2.491307 -2.339722 0.269649
H  5.088985 -2.214112 0.322083
H  -3.806532 1.076137 -0.405973
H  -2.705651 2.539205 1.853067
H  -2.427741 4.216555 1.240995
H  -1.026163 3.19105 1.730871
H  -6.206411 0.768044 0.497971
H  -6.875062 -0.784158 -0.101945
H  -6.138262 0.382977 -1.247167
