program: Gaussian 09
title: 000178939
version: EM64L-G09RevD.01
frameworkgroup: C1[X(C14H12O4)]
method: RPBEPBE
basis: SDD
operation: Freq
keyword: #pfreq=noraman
keyword: PBEPBE/SDD
title: #p freq=noraman PBEPBE/SDD
converged: YES YES NO NO
title: Mulliken charges:
elementType: O O O O C C C C C C C C C C C C C C H H H H H H H H H H H H
charge: -0.290271 -0.336792 -0.288418 -0.439087 0.328213 0.182531 0.099848 0.180954 0.120899 -0.596493 0.259117 -0.017810 -0.384474 -0.355946 -0.237375 -0.221276 -0.505787 -0.523680 0.266378 0.242263 0.251254 0.225969 0.229261 0.387079 0.232895 0.259524 0.225435 0.267585 0.208949 0.229256
chargesum: 0.00000
title: Mulliken charges with hydrogens summed into heavy atoms:
elementType: O O O O C C C C C C C C C C C C C C
charge: -0.290271 -0.336792 -0.288418 -0.052009 0.328213 0.182531 0.099848 0.180954 0.120899 -0.330115 0.259117 -0.017810 -0.142212 -0.104692 -0.011407 0.007985 0.212067 0.182111
polarizability: 2.75464142e+02 -2.76074903e+00 1.82254447e+02 1.67079992e+00 -4.05201310e-01 7.51845300e+01
1716.lowfreq: -7.3148 -0.0009 -0.0008 -0.0007 3.7719 8.2051 35.5697 59.0173 84.2182
frequency: 35.5347 59.0027 84.2167 91.8957 109.2963 141.7441 158.2263 174.1268 182.8639 226.4733 256.5044 271.5224 302.4852 320.9594 348.8534 364.6022 385.3667 428.3167 438.0732 481.2940 519.6825 537.0473 553.9044 579.4736 596.1338 616.7839 658.1590 679.1953 723.6786 749.0776 750.5952 762.0316 781.3634 837.4398 859.2159 870.7051 872.3376 937.9647 958.4049 977.1367 986.8020 1011.8914 1064.8676 1088.6001 1115.1662 1118.1357 1138.2790 1152.5368 1159.4529 1162.9809 1167.5213 1197.6183 1208.4052 1262.3246 1272.1868 1326.6797 1397.5820 1415.7961 1421.6072 1434.6336 1441.0810 1454.7660 1457.7642 1461.0972 1464.1794 1474.4717 1477.2644 1482.6985 1589.8671 1610.1937 1616.2330 1644.3733 2975.3448 2989.5679 3085.9906 3097.8109 3129.7645 3134.0336 3135.8986 3146.8303 3162.1106 3174.5166 3175.8386 3463.3674
redmass: 2.4523 2.8615 4.7877 2.7202 2.3126 2.8728 1.5168 2.5129 3.1212 3.7356 5.0513 5.5434 5.6161 5.1969 5.5631 6.3464 7.0430 5.3773 3.2048 6.8173 4.0198 1.3623 3.9558 4.4858 6.5222 7.2385 7.2680 5.6573 5.0555 5.8867 2.3997 1.7739 6.3928 6.3155 1.3797 4.8381 1.7954 1.3876 7.4079 1.3078 8.0525 2.0336 5.0471 2.7110 1.2400 1.2463 1.9988 1.7287 1.5108 1.4334 1.3548 3.8331 2.8530 1.6533 1.6581 3.4826 4.3615 2.5151 2.2287 2.0238 1.8519 1.2879 1.0885 2.0495 1.9048 1.0944 2.8993 1.1349 7.4908 8.3149 7.7001 9.1666 1.0353 1.0322 1.0965 1.1013 1.1049 1.0856 1.1050 1.0908 1.0960 1.0927 1.0989 1.0639
irintensity: 5.2221 6.5890 0.5804 1.1334 0.8897 0.4358 2.1557 3.0774 4.0853 1.6608 2.4275 0.1531 8.0389 7.9437 2.7083 0.9138 3.3165 3.1672 7.6784 3.6602 28.0572 103.1196 5.1760 13.7166 2.0224 23.2685 3.0933 8.9619 2.4156 9.5094 34.5281 68.3179 9.3025 0.3579 0.9797 5.6258 26.0760 3.0980 94.4903 0.0021 72.3614 23.4060 196.1116 4.1861 9.8467 5.4248 57.4964 73.4410 5.6030 15.1792 74.5752 89.9510 18.0005 180.3914 56.9102 103.4552 16.5216 36.0644 123.7041 29.4828 18.8044 48.8630 15.0097 23.4812 79.6271 30.9944 26.1544 8.9181 20.2819 40.8407 12.4251 6.4976 95.7971 56.7251 38.1785 29.1831 15.6762 1.0454 19.6569 10.0505 22.2057 2.4862 15.2409 102.3759
temp: 298.150 k
press: 1.00000 atm
elementType: 8 8 8 8 6 6 6 6 6 6 6 6 6 6 6 6 6 6 1 1 1 1 1 1 1 1 1 1 1 1
symmnumber: 1
zpe: 595918.7 jmol-1
zpe.correction: 0.226973 hartree
zpe.thermalcorrener: 0.242900 hartree
zpe.thermalcorrenthalpy: 0.243844 hartree
zpe.thermalcorrgfe: 0.183489 hartree
zpe.sumelectzpe: -840.268140 hartree
zpe.sumelectthermal: -840.252213 hartree
zpe.sumelectthermalent: -840.251269 hartree
zpe.sumelectthermalfe: -840.311624 hartree
dipole: 0.8169 2.0109 2.1121
dipole: 3.0285
quadrupole: -92.5558 -89.3885 -108.6733
quadrupole: -4.0396 -5.5119 -0.3086
quadrupole: 4.3167 7.4840 -11.8007 -4.0396 -5.5119 -0.3086
hfenergy: -840.4951137 hartree
pointgroup: C01 [X(C14H12O4)]
dipole: 0.3140842 -0.7608269 -0.8614895 debye
polarizability: 275.295544|-2.4253224|181.9444499|6.4834723|5.4259805|75.6631255 unknown
InChI: InChI=1S/C14H12O4/c1-16-11-7-9-8-5-3-4-6-10(8)18-13(9)14(17-2)12(11)15/h3-7,15H,1-2H3
charge 0 multiplicity 1
30 atoms
O  1.139499 -1.515377 -0.102982
O  -1.86465 -2.389265 -0.108083
O  -2.951277 2.341523 0.152989
O  -3.690915 -0.474787 -0.008653
C  0.357988 0.706616 -0.012428
C  1.820024 0.730901 0.006674
C  -0.005862 -0.668836 -0.080476
C  2.250776 -0.62638 -0.049708
C  -1.345852 -1.078937 -0.108518
C  -0.644015 1.698612 0.031204
C  -2.003115 1.314046 0.015324
C  -2.349277 -0.070479 -0.043505
C  2.798562 1.750138 0.065723
C  3.592694 -1.02195 -0.049992
C  4.162582 1.380225 0.066858
C  4.555336 0.01507 0.009809
C  -1.07537 -3.446606 -0.772438
C  -4.116264 2.332705 -0.75813
H  -0.410861 2.764914 0.087296
H  2.508754 2.805094 0.111948
H  3.879594 -2.076214 -0.092437
H  4.932929 2.157369 0.113471
H  5.62007 -0.241641 0.012989
H  -3.697433 -1.471702 -0.031823
H  -1.697288 -4.351504 -0.705652
H  -0.114919 -3.596461 -0.253909
H  -0.89198 -3.183299 -1.830467
H  -4.733511 1.433514 -0.603893
H  -3.781138 2.385496 -1.812371
H  -4.67998 3.241815 -0.499318
