program: Gaussian 09
title: 000178936
version: EM64L-G09RevD.01
frameworkgroup: C1[X(C5H10ClNO2S)]
method: RPBEPBE
basis: SDD
operation: Freq
keyword: #p
keyword: freq=noraman
keyword: PBEPBE/SDD
title: #p freq=noraman PBEPBE/SDD
converged: YES YES NO NO
title: Mulliken charges:
elementType: Cl S O O N C C C C C H H H H H H H H H H
charge: -0.065427 0.175805 -0.427862 -0.229147 -0.623160 -0.094307 -0.707669 -0.542571 0.228898 -0.558091 0.254954 0.259733 0.273323 0.294718 0.253752 0.305445 0.279354 0.272680 0.266738 0.382837
chargesum: 0.00000
title: Mulliken charges with hydrogens summed into heavy atoms:
elementType: Cl S O O N C C C C C
charge: -0.065427 0.175805 -0.045025 -0.229147 -0.038361 0.160646 -0.174613 0.005898 0.228898 -0.018672
polarizability: 1.20293009e+02 -8.41042759e+00 8.19397401e+01 3.17343241e-04 2.39881884e+00 7.63572549e+01
1716.lowfreq: -8.5715 -5.5796 -0.0018 0.0026 0.0036 6.6099 18.6431 36.0211 39.7264
frequency: 16.7778 36.0080 39.6822 77.5391 94.5748 150.6569 198.6697 244.7626 254.8587 263.6052 289.7881 357.6028 422.0170 468.7602 533.7021 585.8884 593.5546 621.8831 637.2963 682.8604 734.2619 758.8947 853.8899 917.0381 936.5425 998.3356 1046.1285 1049.0360 1092.4037 1122.5806 1154.0619 1183.8934 1212.3647 1246.8966 1262.4389 1284.2088 1299.9519 1308.5305 1389.1656 1421.1548 1422.0166 1436.6764 1630.6086 1676.5504 2890.3886 3025.2054 3029.2837 3050.6347 3109.9677 3118.8291 3139.4553 3463.4817 3517.5643 3595.4015
redmass: 6.0855 5.3331 8.0163 6.5103 7.1023 6.8117 3.8769 1.7969 1.5312 3.0551 2.3688 3.8237 3.6941 4.0000 3.7274 1.3592 5.1053 3.4405 1.4006 3.8152 4.1717 2.6032 1.7169 2.0325 1.5142 3.5204 2.3735 2.2328 2.4186 1.0403 1.1684 1.2624 1.4201 1.1479 1.6838 1.2345 1.2709 1.2709 1.8592 1.0879 1.1097 1.1009 1.0932 9.1912 1.0805 1.0617 1.0602 1.0582 1.1049 1.1030 1.1081 1.0447 1.0641 1.0985
irintensity: 2.3187 4.6300 1.1384 4.3960 0.9491 1.0266 2.5086 15.1132 16.5479 15.9182 9.6386 26.8883 4.4178 40.5038 9.3942 14.4579 13.9507 4.0598 353.8995 38.9183 11.9916 1.3288 19.7362 8.8476 5.4791 36.7329 37.0780 274.3065 18.8564 1.9038 4.0824 1.2756 1.5978 10.8699 21.0710 15.8903 14.8698 5.7541 12.4849 20.3943 21.9028 7.2823 52.1037 208.5069 42.5298 8.7437 18.2041 28.6834 7.0649 1.8428 13.8301 3.8931 26.2949 5.5208
temp: 298.150 k
press: 1.00000 atm
elementType: 17 16 8 8 7 6 6 6 6 6 1 1 1 1 1 1 1 1 1 1
symmnumber: 1
zpe: 400439.9 jmol-1
zpe.correction: 0.152520 hartree
zpe.thermalcorrener: 0.165060 hartree
zpe.thermalcorrenthalpy: 0.166004 hartree
zpe.thermalcorrgfe: 0.110579 hartree
zpe.sumelectzpe: -1259.034209 hartree
zpe.sumelectthermal: -1259.021669 hartree
zpe.sumelectthermalent: -1259.020725 hartree
zpe.sumelectthermalfe: -1259.076150 hartree
dipole: 3.4430 -0.0993 1.2249
dipole: 3.6557
quadrupole: -73.0542 -67.5930 -75.2960
quadrupole: 0.1300 -11.4428 -0.4873
quadrupole: -1.0731 4.3880 -3.3149 0.1300 -11.4428 -0.4873
hfenergy: -1259.1867288 hartree
pointgroup: C01 [X(C5H10Cl1N1O2S1)]
dipole: -1.2529912 -0.3070107 -0.6359211 debye
dipolederiv: -0.3683988 -0.078956 -0.1115089 -0.1472796 -0.2730498 -0.1369991 -0.2019846 -0.1340059 -0.3555853 -0.3081313 0.0223102 0.0968567 0.005764 -0.1839802 -0.0115203 0.1257494 0.0321543 -0.0188531 -1.0071717 0.4083673 0.0009685 0.5774186 -0.693188 -0.1076966 -0.0219517 -0.0815722 -0.3280886 -0.8361438 0.168587 0.1532259 -0.0167143 -0.4897979 0.2092146 0.3276604 0.0844839 -0.5555314 -0.7474926 -0.098571 -0.1015077 -0.0533425 -0.4017871 -0.1527354 -0.0911188 -0.1739732 -0.6125369 0.4838699 0.1427237 0.1690654 -0.0072694 0.1246415 0.152405 -0.0466331 0.154235 0.2309932 0.3276198 0.0280958 0.0631779 0.1372383 0.1073498 0.0321482 0.1018347 -0.0095897 0.0227762 0.1212048 0.0774542 -0.1629444 0.077423 0.1108224 -0.0851941 -0.3481833 -0.1531504 0.0194003 1.3910093 -0.4825782 -0.3066882 -0.5324721 0.9102963 -0.2916779 -0.3957628 -0.2122886 0.59569 0.3456416 0.143051 0.1785026 0.1031866 0.3009431 0.2061273 0.3693015 0.2600406 0.4469275 -0.0090173 -0.0461261 -0.0333819 -0.047423 -0.0431468 -0.0754556 -0.0689271 -0.1095489 -0.1206235 -0.0336267 -0.0817915 0.0039089 -0.0517513 -0.0646514 0.0661513 -0.0010666 0.0890367 0.0581536 -0.0137661 0.0036559 0.0094498 -0.0034596 0.0928972 -0.015335 0.0089496 -0.0797251 -0.0652622 0.0526321 -0.001173 0.0345688 0.019533 -0.0702244 0.066096 0.0950315 0.0650483 0.0412548 -0.0063661 -0.0796065 -0.0579833 -0.0487671 0.043804 -0.0710136 0.027464 -0.0412007 -0.0596903 0.071246 0.0455259 -0.0128544 0.0695593 0.1600951 -0.00453 0.1187674 -0.0008921 0.34181 0.2002456 -0.0359113 -0.0199375 -0.0292721 0.1579472 0.1306978 -0.0062089 0.2006308 0.1875483 0.0698788 0.0030945 -0.0412479 0.0707672 -0.0969126 -0.0393782 -0.0843158 -0.0271687 0.018999 -0.0551677 -0.0758545 0.0462373 -0.0866479 0.057128 0.0142381 0.0327914 -0.0075346 -0.087226 0.3219342 -0.0622976 0.0920925 -0.0364909 0.2508138 0.1144575 0.0586026 0.1450203 0.2398441 unknown
polarizability: 119.4292509|10.1431188|79.9610789|3.3707922|-2.2067987|79.199674 unknown
InChI: InChI=1S/C5H10ClNO2S/c6-1-2-10-3-4(7)5(8)9/h4,8H,1-3,7H2
charge 0 multiplicity 1
20 atoms
Cl 4.247498 0.605129 1.431478
S  1.205929 -1.017628 1.208665
O  -2.621379 1.304365 -0.243758
O  -0.575469 0.776235 -1.198677
N  -2.82149 -1.442739 0.203172
C  -1.576561 -0.715591 0.538794
C  -0.365218 -1.65394 0.365959
C  2.149437 -0.256052 -0.255244
C  -1.485853 0.49431 -0.394233
C  3.649412 -0.40035 -0.058267
H  -1.55655 -0.308956 1.578951
H  -0.583748 -2.617649 0.857989
H  -0.162741 -1.842533 -0.700191
H  1.845978 0.793153 -0.378447
H  1.848906 -0.812558 -1.161234
H  -3.648099 -0.839855 0.14514
H  -2.974693 -2.275839 0.779085
H  3.952054 -1.437348 0.148964
H  4.206072 0.009095 -0.916172
H  -2.563386 2.080348 -0.864576
