program: Gaussian 09
title: 000178967
version: EM64L-G09RevD.01
frameworkgroup: C1[X(C15H14N4O6S2)]
method: RPBEPBE
basis: SDD
operation: Freq
keyword: #p
keyword: freq=noraman
keyword: PBEPBE/SDD
title: #p freq=noraman PBEPBE/SDD
converged: YES YES NO NO
title: Mulliken charges:
elementType: S S O O O O O O N N N N C C C C C C C C C C C C C C C H H H H H H H H H H H H H H
charge: 0.206577 0.264604 -0.149438 -0.402868 -0.288953 -0.237321 -0.397227 -0.246335 -0.155389 -0.397999 -0.176744 -0.562160 -0.491693 -0.169614 0.103082 0.274593 -0.708133 -0.204109 0.156142 0.141631 0.154633 0.380719 -0.228624 -0.576860 -0.758105 -0.202585 0.224604 0.323524 0.306407 0.394217 0.267158 0.283967 0.269143 0.286651 0.390298 0.262973 0.257561 0.346326 0.343597 0.333713 0.382039
chargesum: 0.00000
title: Mulliken charges with hydrogens summed into heavy atoms:
elementType: S S O O O O O O N N N N C C C C C C C C C C C C C C C
charge: 0.206577 0.264604 -0.149438 -0.012570 -0.288953 -0.237321 -0.015188 -0.246335 -0.155389 -0.003782 -0.176744 0.115150 -0.168169 0.136793 0.103082 0.274593 -0.157008 0.065034 0.156142 0.141631 0.154633 0.380719 0.058027 -0.056327 -0.411779 -0.202585 0.224604
polarizability: 3.29704321e+02 -3.48352743e+01 2.59053703e+02 1.63512914e+01 1.85647511e+01 1.74833939e+02
1716.lowfreq: -7.8042 -2.6385 -0.0016 -0.0011 0.0008 2.9463 8.5430 23.4512 25.4569
frequency: 5.4039 23.4352 25.4476 34.8150 52.8007 61.8325 65.6913 70.3473 75.7442 90.6056 98.6845 115.7938 133.1991 139.7548 159.9945 176.0163 210.4641 218.1889 238.6872 253.0373 265.4534 273.4016 289.7316 313.2308 338.7257 349.9993 375.4868 387.2361 407.9176 428.5847 436.3455 437.7466 462.0681 469.8191 517.2736 535.8318 540.7137 546.5243 568.0802 576.8197 579.7762 609.2926 614.3119 619.8414 642.3995 650.5858 658.7265 684.2291 710.6531 719.6191 726.5467 746.7167 755.0007 780.1843 808.0506 813.9343 828.5256 838.1648 875.8084 883.0100 912.7658 930.1989 931.3930 950.8342 962.0265 986.2042 1009.6973 1037.1986 1041.9838 1056.5659 1075.8503 1101.1997 1114.7929 1146.4370 1166.0440 1173.0823 1187.2278 1207.4724 1223.0610 1232.2313 1235.9260 1244.4011 1263.4225 1280.1903 1286.3118 1288.0247 1309.3029 1317.5220 1326.0280 1352.6554 1420.0004 1424.7011 1448.9545 1500.5189 1530.2284 1578.7840 1594.5302 1628.0194 1630.4732 1643.7003 1646.4324 1652.2406 1737.4097 3001.2086 3019.1063 3029.8902 3068.2855 3079.8954 3091.1272 3114.2445 3132.3529 3139.3338 3190.4083 3508.3564 3532.7985 3554.9355 3704.2004
redmass: 7.5155 9.7928 9.4455 7.5777 9.2224 8.2119 9.0944 10.0439 9.2407 5.9892 9.0633 9.4295 6.6098 7.6221 5.9495 5.8566 2.7384 5.8860 7.1805 7.0945 7.1161 6.8923 8.3999 1.1768 6.1276 5.0180 6.0783 6.0541 7.0438 2.8068 1.2693 5.2310 5.3440 4.0509 4.8085 3.8799 4.1569 3.7270 9.0202 5.3300 5.4950 2.2089 2.0822 2.1962 4.0861 4.1859 5.5126 3.5761 4.8328 4.8183 5.3527 4.7625 5.7766 5.1106 2.2153 1.9760 1.7056 4.3690 4.0316 1.8264 1.2736 2.5200 2.0142 1.8707 3.7659 5.1574 3.3546 3.0105 2.8211 4.1934 2.0761 2.0982 2.2560 1.1750 1.7201 1.8150 1.4133 1.4297 1.6725 1.5276 1.3460 2.6763 1.4855 2.9712 1.4162 2.4594 2.0380 2.2763 1.5976 1.8338 4.5641 1.0953 1.1006 5.5559 2.5152 3.0211 2.3677 7.2942 2.2054 8.7192 5.8258 6.0754 12.7939 1.0614 1.0573 1.0837 1.0997 1.0895 1.1038 1.0879 1.0902 1.0904 1.0998 1.0640 1.0644 1.0457 1.1045
irintensity: 0.7396 0.7939 0.6935 2.6364 0.4499 2.7085 1.1873 1.3758 1.2316 1.6940 1.4346 1.5212 2.1771 0.5932 1.2536 4.7470 2.5216 3.0670 5.7320 3.5768 5.3960 2.9659 11.4638 38.7054 19.0022 7.1739 0.3013 7.4221 12.4053 13.1568 250.7760 10.8137 18.0379 8.2328 7.1752 48.2684 39.9761 22.3073 0.6910 7.3382 9.3576 68.2448 129.9809 23.7478 33.7828 42.3187 23.4490 7.9534 14.3048 47.4407 35.5683 6.9512 18.0352 5.6585 2.3012 48.8437 33.0779 14.3391 5.9839 3.7742 39.4772 53.0264 32.4617 32.6680 39.1252 79.1607 73.1992 73.9930 49.9463 236.1708 240.5840 77.0976 34.6598 3.4755 9.6211 12.8080 27.8330 8.4851 24.9009 37.0843 2.0085 79.7489 66.3506 47.5801 1.0493 186.4405 78.7944 62.4615 6.3823 34.7219 183.7564 17.6189 16.6626 104.0727 276.5048 286.5667 190.9510 127.6124 453.6312 61.4276 218.1798 38.0328 414.9749 21.2883 17.9799 65.8056 3.2954 18.1233 1.5676 606.4620 1.4728 0.3469 77.6313 36.9886 53.2808 112.3154 54.7886
temp: 298.150 k
press: 1.00000 atm
elementType: 16 16 8 8 8 8 8 8 7 7 7 7 6 6 6 6 6 6 6 6 6 6 6 6 6 6 6 1 1 1 1 1 1 1 1 1 1 1 1 1 1
symmnumber: 1
zpe: 749272.0 jmol-1
zpe.correction: 0.285383 hartree
zpe.thermalcorrener: 0.311472 hartree
zpe.thermalcorrenthalpy: 0.312416 hartree
zpe.thermalcorrgfe: 0.224924 hartree
zpe.sumelectzpe: -2044.498041 hartree
zpe.sumelectthermal: -2044.471951 hartree
zpe.sumelectthermalent: -2044.471007 hartree
zpe.sumelectthermalfe: -2044.558499 hartree
dipole: 0.3919 4.1087 1.2749
dipole: 4.3198
quadrupole: -158.7594 -157.3846 -168.2045
quadrupole: -3.9529 -11.7829 -5.0393
quadrupole: 2.6901 4.0649 -6.7550 -3.9529 -11.7829 -5.0393
hfenergy: -2044.7834232 hartree
pointgroup: C01 [X(C15H14N4O6S2)]
dipole: 0.1017546 1.3744328 0.994486 debye
polarizability: 331.7698826|-36.0117267|236.96968|4.8235626|39.9882731|194.8524007 unknown
InChI: InChI=1S/C15H14N4O6S2/c16-15-17-7(5-27-15)6(1-2-9(20)21)11(22)18-10-12(23)19-8(14(24)25)3-4-26-13(10)19/h1,3,5,10,13,18,20,24H,2,4,16H2
charge 0 multiplicity 1
41 atoms
S  -1.846029 0.397111 2.036022
S  3.074579 3.37861 0.849418
O  -2.463364 -0.399798 -2.352801
O  -5.380654 -1.133547 -1.740851
O  1.295794 -2.609421 -0.324075
O  -6.626747 0.530927 -0.693116
O  6.603646 -2.093564 -0.079568
O  6.151197 -0.117829 1.047942
N  -3.257935 -0.783833 -0.063825
N  0.056447 -0.635761 -0.281332
N  1.319785 1.715363 -0.280262
N  0.471137 3.936391 -0.038143
C  -2.211727 -1.103667 0.931009
C  -1.201364 -1.327549 -0.261275
C  -2.35079 -0.772833 -1.178656
C  -4.480419 -0.157346 0.244733
C  -3.67106 0.565117 2.571441
C  -4.681648 0.44455 1.460473
C  1.250148 -1.338054 -0.321587
C  -5.597873 -0.183498 -0.746795
C  2.517598 -0.488875 -0.392695
C  2.49051 0.949076 -0.030835
C  3.631812 -1.167575 -0.814931
C  5.006413 -0.598348 -1.101191
C  3.522318 1.650563 0.580244
C  1.441466 2.977449 0.100604
C  5.958205 -0.864816 0.060567
H  -2.443497 -1.968111 1.570542
H  -1.002858 -2.403096 -0.422747
H  0.128141 0.405496 -0.344361
H  -3.738056 1.560584 3.044589
H  -3.858122 -0.187167 3.360634
H  -5.677129 0.869466 1.637742
H  3.498373 -2.242604 -0.991386
H  -6.114549 -1.090803 -2.410985
H  4.958649 0.492849 -1.256265
H  5.417606 -1.088014 -2.000184
H  4.478602 1.283012 0.953775
H  -0.415051 3.672196 -0.464232
H  0.595411 4.880585 0.313806
H  7.177936 -2.265137 0.716156
