program: Gaussian 09
title: 000178947
version: EM64L-G09RevD.01
frameworkgroup: C1[X(C16H14BrNOS)]
method: RPBEPBE
basis: SDD
operation: Freq
keyword: #p
keyword: freq=noraman
keyword: PBEPBE/SDD
title: #p freq=noraman PBEPBE/SDD
converged: YES YES NO NO
title: Mulliken charges:
elementType: Br S O N C C C C C C C C C C C C C C C C H H H H H H H H H H H H H H
charge: 0.000120 0.156010 -0.260339 -0.437851 -0.693438 0.334060 0.206163 0.268774 0.192952 -0.581583 -0.399421 0.624897 -0.369604 -0.539151 -0.383457 -0.218657 -0.190446 0.208935 -0.833262 -0.796544 0.254037 0.254874 0.324510 0.263881 0.262684 0.245057 0.248900 0.315467 0.257589 0.266351 0.275793 0.241263 0.266071 0.235364
chargesum: 0.00000
title: Mulliken charges with hydrogens summed into heavy atoms:
elementType: Br S O N C C C C C C C C C C C C C C C C
charge: 0.000120 0.156010 -0.260339 -0.122384 -0.184527 0.334060 0.206163 0.268774 0.192952 -0.257073 -0.135541 0.624897 -0.106921 -0.539151 -0.138400 -0.218657 0.058454 0.208935 -0.033529 -0.053846
polarizability: 4.14343447e+02 -1.99534563e+00 2.19191797e+02 1.32008927e+00 -4.82120683e+00 1.05496388e+02
1716.lowfreq: -80.1900 0.0006 0.0008 0.0017 1.7188 4.3112 6.1508 30.8347 38.5886
frequency: -80.1895 30.8298 38.5821 56.3964 75.5342 79.4107 89.8713 132.0771 141.5375 142.9394 162.8678 180.8106 214.0257 214.7565 254.6210 272.5882 297.4180 312.2743 351.8786 397.5952 410.1225 437.5726 459.6767 474.0882 524.5038 532.5190 567.9470 580.1138 607.8678 631.6139 642.5496 655.6351 676.1433 727.5301 755.2647 757.0317 770.4093 798.8304 827.0192 843.8776 871.9738 902.7191 922.4331 926.3502 949.5804 955.5858 968.7503 977.6741 986.2865 1003.1115 1016.0000 1031.0083 1056.4130 1116.7075 1134.9261 1143.3616 1175.7609 1202.1071 1203.4814 1232.7782 1243.2845 1274.5477 1306.3151 1340.9367 1356.4727 1368.5174 1376.5594 1410.2564 1421.1185 1426.2440 1439.6275 1443.2298 1451.3502 1459.6249 1466.6925 1482.5596 1499.3253 1574.8518 1578.3162 1609.5955 1619.9949 1626.2119 2988.7154 2988.8821 3012.6549 3033.8874 3073.5097 3136.6579 3136.7556 3138.4484 3141.6008 3146.5744 3156.4461 3171.9896 3177.6055 3378.2771
redmass: 1.0342 5.6762 3.7359 4.5174 6.7309 4.5055 4.8401 2.0263 4.4758 1.6701 5.7307 8.1259 3.3091 6.2991 3.6658 6.6011 4.6870 4.5110 7.5687 4.0356 6.2743 3.3765 3.3414 4.7410 3.3858 4.7965 4.7960 3.1902 6.0447 6.5972 4.2303 6.8452 6.8901 3.8526 5.6007 2.7090 4.8383 1.2491 1.4839 5.0924 1.4343 1.4776 1.5922 4.2790 2.9298 1.3733 1.1753 1.8240 1.2792 2.2142 4.4593 1.6660 2.0796 2.1365 1.1510 1.9055 1.9112 1.6437 3.5439 1.8467 1.6483 1.4387 3.0678 1.1740 4.1237 5.3124 1.2588 4.0469 1.9159 1.9709 1.8894 1.0634 1.3889 1.0565 1.0471 4.1170 2.1956 7.6896 5.7705 7.6519 7.0302 5.4518 1.0611 1.0383 1.0278 1.0993 1.0981 1.0985 1.1048 1.0898 1.1054 1.0923 1.0929 1.0956 1.0933 1.0768
irintensity: 0.2395 0.3862 2.6719 0.1318 2.4043 5.4434 0.5146 3.1670 2.1427 1.5838 0.2491 2.1302 4.3823 2.9261 1.5040 4.3517 1.5527 4.3920 6.5541 4.6488 0.5103 2.9177 13.3234 1.3626 4.7617 3.9137 4.6963 0.0502 10.1121 3.5865 3.0858 0.6027 2.0951 1.6100 10.4345 5.1870 4.0227 43.7171 51.1986 44.7312 16.4116 9.0290 0.7540 3.2189 28.8580 0.7533 4.3021 32.4912 23.4428 13.9664 7.0548 7.7825 28.7165 9.2788 0.0654 2.6560 33.6435 2.6978 10.3817 45.6225 92.9761 15.7794 26.2273 13.7221 115.1626 6.4187 65.0609 47.1353 39.8067 102.8050 96.4626 16.7015 57.4644 12.6566 19.5032 14.3269 537.1618 39.9201 90.6394 13.8106 46.9266 89.3271 8.2294 8.0540 27.5360 4.7179 13.9162 12.1897 8.2305 7.4532 10.4157 2.9567 3.3946 7.0351 7.6558 104.4105
temp: 298.150 k
press: 1.00000 atm
elementType: 35 16 8 7 6 6 6 6 6 6 6 6 6 6 6 6 6 6 6 6 1 1 1 1 1 1 1 1 1 1 1 1 1 1
symmnumber: 1
zpe: 672067.9 jmol-1
zpe.correction: 0.255977 hartree
zpe.thermalcorrener: 0.274340 hartree
zpe.thermalcorrenthalpy: 0.275284 hartree
zpe.thermalcorrgfe: 0.207409 hartree
zpe.sumelectzpe: -1158.231962 hartree
zpe.sumelectthermal: -1158.213599 hartree
zpe.sumelectthermalent: -1158.212655 hartree
zpe.sumelectthermalfe: -1158.280530 hartree
dipole: 3.4408 2.5906 0.9455
dipole: 4.4096
quadrupole: -125.0144 -132.2325 -136.4147
quadrupole: 10.8255 3.5361 4.5662
quadrupole: 6.2061 -1.0120 -5.1941 10.8255 3.5361 4.5662
hfenergy: -1158.4879388 hartree
pointgroup: C01 [X(C16H14Br1N1O1S1)]
dipole: -1.2287715 -1.186355 0.3040774 debye
polarizability: 412.3170237|19.9172552|220.0590737|-3.1071742|12.1146525|106.6555344 unknown
InChI: InChI=1S/C16H14BrNOS/c1-9(19)18-15-7-11-5-10-6-12(17)3-4-13(10)14(11)8-16(15)20-2/h3-4,6-8,18H,5H2,1-2H3
charge 0 multiplicity 1
34 atoms
Br 6.73617 0.859608 0.073655
S  -2.721903 -2.787084 -0.637893
O  -3.841649 2.359024 0.423141
N  -3.544666 0.091983 -0.125229
C  1.256415 1.839786 0.262745
C  0.127512 0.834482 0.065247
C  0.670143 -0.461435 -0.187719
C  2.50643 0.983032 0.095307
C  2.139439 -0.372645 -0.171246
C  -1.255319 1.057631 0.1002
C  -0.195506 -1.555309 -0.400113
C  -2.134707 -0.042737 -0.117684
C  3.857259 1.363639 0.170267
C  -1.588846 -1.349017 -0.353811
C  3.134932 -1.355327 -0.365363
C  4.835642 0.362012 -0.02663
C  4.497664 -0.983949 -0.292303
C  -4.321803 1.227693 0.116563
C  -2.926381 -3.373937 1.157199
C  -5.8239 0.979308 -0.019952
H  1.211124 2.318388 1.260296
H  1.212155 2.658614 -0.481406
H  -1.686412 2.043182 0.287575
H  0.188617 -2.560439 -0.601583
H  4.150056 2.398073 0.373615
H  2.871418 -2.39811 -0.572605
H  5.285006 -1.728491 -0.439875
H  -4.032601 -0.780528 -0.378799
H  -3.622554 -4.226853 1.129851
H  -3.33967 -2.562656 1.775432
H  -1.948992 -3.692967 1.547472
H  -6.083595 0.655459 -1.04485
H  -6.355994 1.915215 0.202186
H  -6.168483 0.196851 0.681408
