program: Gaussian 09
title: 000178920
version: EM64L-G09RevD.01
frameworkgroup: C1[X(C11H15NO4)]
method: RPBEPBE
basis: SDD
operation: Freq
keyword: #p
keyword: freq=noraman
keyword: PBEPBE/SDD
title: #p freq=noraman PBEPBE/SDD
converged: YES YES NO NO
title: Mulliken charges:
elementType: O O O O N C C C C C C C C C C C H H H H H H H H H H H H H H H
charge: -0.425065 -0.227270 -0.299708 -0.258579 -0.331368 -0.292889 -0.174364 -0.081180 -0.121405 -0.516336 0.247176 0.096430 -0.761804 -0.324465 0.139710 -0.500361 0.271918 0.267607 0.277294 0.196208 0.268068 0.229994 0.204002 0.245024 0.211511 0.284364 0.330650 0.332720 0.229692 0.240798 0.241628
chargesum: 0.00000
title: Mulliken charges with hydrogens summed into heavy atoms:
elementType: O O O O N C C C C C C C C C C C
charge: -0.092345 -0.227270 -0.299708 -0.258579 -0.000719 -0.020971 0.093244 0.196114 0.074803 -0.018274 0.247176 0.096430 -0.101267 -0.040101 0.139710 0.211757
polarizability: 1.82105539e+02 1.41974542e+01 1.42028431e+02 1.97615680e+00 -9.65196678e+00 9.46950540e+01
1716.lowfreq: -15.5643 -11.2678 -0.0008 -0.0003 0.0007 3.5294 9.4248 51.5874 63.1992
frequency: -13.5910 51.5610 63.1672 84.5198 103.6619 106.0256 138.6205 177.2949 189.7315 223.1997 238.9936 265.9793 289.6748 306.1461 309.0246 347.5642 372.7787 399.4391 460.3435 488.4779 508.8139 515.9350 555.3270 596.0855 623.4309 664.0022 714.8218 722.3135 754.8224 787.5295 837.7636 866.0593 896.8372 916.5426 940.6760 977.2064 982.5078 1012.6594 1028.8981 1049.3111 1057.6738 1079.1916 1110.3150 1113.4538 1118.1584 1145.5134 1147.6994 1169.6062 1216.9914 1227.3894 1236.8876 1246.3360 1257.8081 1277.9032 1280.1734 1302.1283 1327.1199 1339.5378 1357.9507 1381.3946 1386.9518 1390.2385 1426.1903 1433.9043 1450.4226 1465.8664 1468.8501 1474.7934 1480.5347 1602.4012 1623.0811 1669.2524 2936.1523 2965.0592 2975.4500 3001.2167 3001.4607 3011.8973 3018.2720 3052.9815 3079.5256 3101.7085 3101.9394 3143.3698 3181.6638 3523.5861 3559.7541
redmass: 3.8914 3.5142 4.1947 1.5822 3.3251 4.3563 3.4362 4.6637 3.2233 1.5314 1.5363 3.9379 2.0653 2.0110 4.3198 4.0308 4.6036 4.4050 4.5116 4.4623 3.4974 3.5995 4.0111 3.9363 5.4722 3.2024 2.0013 2.8944 5.9771 4.2297 2.4290 2.7677 3.6423 1.4711 2.5678 2.2409 1.7322 3.6111 2.3820 2.7683 1.9268 2.9511 2.9125 1.2594 2.0430 1.4393 2.0314 1.8331 1.4341 1.5213 1.5512 1.3622 1.3616 1.4409 2.9777 1.2896 1.3621 1.6637 1.4578 2.2369 1.3380 1.3767 1.2506 1.9572 1.0503 1.0540 1.0508 1.0947 1.0450 9.3953 7.4777 6.3262 1.0845 1.0372 1.0824 1.0618 1.0452 1.0729 1.0824 1.0979 1.0987 1.1044 1.1006 1.1046 1.0943 1.0772 1.0661
irintensity: 0.3545 2.1028 1.1805 5.9191 1.3151 2.4376 7.4965 0.6299 0.7306 1.7731 1.5089 34.2908 54.5780 69.5969 19.1126 1.7059 4.3220 0.7448 8.0286 6.3161 3.3671 2.1489 25.4807 6.8070 4.8273 11.8156 114.6863 6.4897 13.1648 14.3541 3.6705 14.1539 4.0212 11.0506 11.2658 13.8410 22.1063 59.9020 14.4720 130.3281 14.6850 104.1587 15.0839 0.0721 26.4496 56.2787 57.7345 4.0652 51.0352 259.6881 200.0743 13.5768 36.3554 27.9126 20.1744 31.4234 11.9447 52.9299 23.0778 4.2825 9.7136 3.3873 13.0440 100.5906 13.6408 9.5773 13.0060 9.4065 15.1374 277.9052 341.2773 124.0467 46.1960 40.6074 9.3289 14.6362 32.1603 15.5472 13.3926 47.3230 21.0263 28.0212 15.6985 17.6944 0.6320 49.4243 3.2330
temp: 298.150 k
press: 1.00000 atm
elementType: 8 8 8 8 7 6 6 6 6 6 6 6 6 6 6 6 1 1 1 1 1 1 1 1 1 1 1 1 1 1 1
symmnumber: 1
zpe: 654880.7 jmol-1
zpe.correction: 0.249431 hartree
zpe.thermalcorrener: 0.264497 hartree
zpe.thermalcorrenthalpy: 0.265441 hartree
zpe.thermalcorrgfe: 0.207316 hartree
zpe.sumelectzpe: -782.605820 hartree
zpe.sumelectthermal: -782.590754 hartree
zpe.sumelectthermalent: -782.589809 hartree
zpe.sumelectthermalfe: -782.647934 hartree
dipole: -1.8380 1.2521 1.0841
dipole: 2.4741
quadrupole: -82.0765 -98.6784 -96.5439
quadrupole: -14.1786 7.5747 -3.4553
quadrupole: 10.3564 -6.2455 -4.1109 -14.1786 7.5747 -3.4553
hfenergy: -782.8552505 hartree
pointgroup: C01 [X(C11H15N1O4)]
dipole: 0.7135728 0.5324986 -0.3933576 debye
polarizability: 182.5583268|-13.5882089|140.0212505|0.5486408|12.8761871|96.2494466 unknown
InChI: InChI=1S/C11H15NO4/c1-5-8(13)3-6-7(11(15)16-2)4-12-10(14)9(5)6/h4-6,8-9,12-13H,3H2,1-2H3
charge 0 multiplicity 1
31 atoms
O  -2.735285 -2.341935 1.356502
O  -2.269746 2.507745 0.58622
O  3.620522 0.263572 0.210681
O  2.564412 -1.619094 -0.685717
N  0.020071 2.241526 0.741994
C  -1.296137 0.532271 -0.526133
C  -0.066584 -0.424146 -0.357478
C  -2.562608 -0.329096 -0.173234
C  -2.001422 -1.72695 0.241959
C  -0.552936 -1.471674 0.683457
C  1.225058 0.2742 0.010942
C  -1.249951 1.814068 0.314326
C  -3.601388 -0.386187 -1.309093
C  1.211472 1.535783 0.545282
C  2.483437 -0.460398 -0.196429
C  4.910412 -0.438443 0.031183
H  -1.363295 0.888181 -1.574911
H  0.092364 -0.963341 -1.31099
H  -3.041746 0.108106 0.72321
H  -2.015283 -2.405826 -0.640921
H  0.068624 -2.380445 0.687409
H  -0.560894 -1.044905 1.704861
H  -4.449663 -1.048422 -1.046219
H  -4.016646 0.616533 -1.513194
H  -3.152599 -0.772813 -2.244546
H  2.133978 2.038019 0.846124
H  0.037419 3.145179 1.223318
H  -3.663902 -2.528421 1.066435
H  5.668966 0.269641 0.394204
H  5.071583 -0.682097 -1.032645
H  4.925567 -1.371929 0.619002
