program: Gaussian 09
title: 000178949
version: EM64L-G09RevD.01
frameworkgroup: C1[X(C17H17NO2S)]
method: RPBEPBE
basis: SDD
operation: Freq
keyword: #p
keyword: freq=noraman
keyword: PBEPBE/SDD
title: #p freq=noraman PBEPBE/SDD
converged: YES YES NO NO
title: Mulliken charges:
elementType: S O O N C C C C C C C C C C C C C C C C C H H H H H H H H H H H H H H H H H
charge: 0.151696 -0.265031 -0.263171 -0.445231 -0.702165 0.323191 0.219092 0.306422 0.170631 -0.579387 -0.412517 -0.585028 -0.369885 0.612580 -0.531865 0.330373 -0.367287 0.211002 -0.834144 -0.535882 -0.784724 0.248409 0.249268 0.323021 0.262816 0.254985 0.240073 0.250027 0.306257 0.255407 0.266951 0.275081 0.220956 0.221316 0.245955 0.256093 0.254052 0.220665
chargesum: 0.00000
title: Mulliken charges with hydrogens summed into heavy atoms:
elementType: S O O N C C C C C C C C C C C C C C C C C
charge: 0.151696 -0.265031 -0.263171 -0.138975 -0.204488 0.323191 0.219092 0.306422 0.170631 -0.256366 -0.149702 -0.330043 -0.129812 0.612580 -0.531865 0.330373 -0.117260 0.211002 -0.036706 0.152345 -0.053915
polarizability: 3.99903234e+02 -2.47245162e+00 2.28136091e+02 1.07783886e+00 -3.83933525e+00 1.14000995e+02
1716.lowfreq: -2.0366 0.0012 0.0013 0.0022 3.2595 5.4937 33.4280 37.4394 44.9097
frequency: 33.3913 37.4316 44.8760 54.5387 77.3579 84.9406 92.3575 115.0978 134.3991 147.5592 151.3360 182.5576 196.0547 214.0344 226.0494 240.2914 272.8751 289.7138 316.2222 337.6089 381.5805 411.3104 440.7323 443.5824 454.3218 459.5046 530.3752 544.0159 550.4007 571.1332 592.3458 627.8529 633.7679 651.5179 676.6985 710.5026 732.0636 759.3702 761.2061 781.3581 797.8769 829.5788 850.0213 898.1344 900.7297 918.2323 927.9833 956.5655 958.5886 968.4798 975.8776 986.0081 990.9114 1007.9396 1018.2325 1040.8002 1100.7911 1112.5572 1133.6993 1141.3095 1148.6786 1157.0460 1193.8960 1203.1694 1230.7984 1232.6781 1255.1747 1285.9143 1311.5981 1340.4384 1358.2901 1375.6187 1388.3922 1423.4201 1424.5081 1428.7720 1442.9543 1447.4388 1450.7355 1457.9275 1460.2906 1466.5668 1467.8610 1473.3856 1490.3032 1499.5180 1577.4323 1591.7030 1614.4935 1620.0439 1623.3242 2957.2704 2985.3130 2995.5500 3012.2565 3029.8328 3044.3353 3095.5692 3099.5483 3123.9489 3134.6436 3136.5361 3140.5881 3146.1447 3150.0634 3169.0932 3175.7304 3391.4153
redmass: 3.2945 2.8598 1.7079 2.5913 3.3074 3.8560 4.1111 4.2265 1.2247 3.0706 4.2851 2.8954 3.7292 2.7730 7.1556 1.5396 2.5396 5.0552 5.2318 5.6304 5.7936 3.9626 3.2615 4.9314 4.6278 3.4563 4.8227 4.4151 3.1868 5.1548 3.3726 5.5581 6.8152 3.7989 6.9393 5.7942 3.6072 5.8060 2.8430 4.7896 1.2810 1.4702 1.4785 1.5075 4.1300 1.6272 4.9963 1.3694 3.2946 1.1767 1.8067 1.2959 4.1257 1.8668 5.3536 1.6274 2.0057 1.2603 1.1529 1.8421 1.4808 1.4696 3.1044 1.6163 3.5254 1.6171 2.0367 1.4751 3.6018 1.1721 4.5741 5.4065 1.2148 1.3989 3.2339 1.6322 1.0582 2.5545 1.0464 2.2182 1.0732 1.0518 1.1124 1.0990 3.7705 2.4619 6.3764 7.5423 4.6471 7.8704 7.0758 1.0331 1.0609 1.0358 1.0278 1.0992 1.1038 1.0979 1.1011 1.0992 1.0894 1.1049 1.1055 1.0922 1.0911 1.0955 1.0933 1.0768
irintensity: 2.4388 1.2685 0.1114 4.7497 6.0295 2.0501 2.0239 2.8723 0.8662 1.5500 3.3097 1.4269 1.7505 6.5721 1.5833 0.0103 0.8315 4.2955 1.9008 2.7328 4.7051 1.4101 2.5639 21.2577 3.6865 13.1970 6.5539 2.3097 1.4160 7.2025 0.0620 11.7307 4.0919 3.5466 1.8501 3.1130 2.7848 3.0170 2.4937 5.8300 39.0310 44.4574 33.3400 11.2688 7.5498 0.5491 5.8983 1.8381 10.7554 4.3869 31.4428 30.7985 20.5782 40.3309 19.1208 14.0506 33.3276 0.2424 0.0992 9.2019 26.5163 21.9860 90.8606 1.7519 15.6697 56.6400 244.5569 9.6231 11.0137 8.7210 112.0621 15.4810 68.3290 55.0590 72.9591 38.0673 21.6677 28.8466 13.4338 121.7486 26.0218 13.5250 26.7987 65.3492 41.0544 488.3388 121.9530 16.6157 100.5189 2.1528 125.0712 80.2057 12.2189 15.1612 28.7756 6.0262 49.9214 7.9496 19.3892 30.7775 9.7200 12.3547 11.0760 3.7368 12.5730 11.7276 7.1392 104.7652
temp: 298.150 k
press: 1.00000 atm
elementType: 16 8 8 7 6 6 6 6 6 6 6 6 6 6 6 6 6 6 6 6 6 1 1 1 1 1 1 1 1 1 1 1 1 1 1 1 1 1
symmnumber: 1
zpe: 781800.6 jmol-1
zpe.correction: 0.297772 hartree
zpe.thermalcorrener: 0.318100 hartree
zpe.thermalcorrenthalpy: 0.319044 hartree
zpe.thermalcorrgfe: 0.247469 hartree
zpe.sumelectzpe: -1259.793922 hartree
zpe.sumelectthermal: -1259.773594 hartree
zpe.sumelectthermalent: -1259.772650 hartree
zpe.sumelectthermalfe: -1259.844225 hartree
dipole: -0.0937 0.7556 1.2653
dipole: 1.4768
quadrupole: -103.4171 -130.1549 -133.4085
quadrupole: 21.2805 1.3896 4.4475
quadrupole: 18.9097 -7.8281 -11.0817 21.2805 1.3896 4.4475
hfenergy: -1260.091694 hartree
pointgroup: C01 [X(C17H17N1O2S1)]
dipole: 0.0664952 -0.3111681 0.4861203 debye
polarizability: 399.025185|12.3409386|228.5439188|-3.4682182|7.8484141|114.4712173 unknown
InChI: InChI=1S/C17H17NO2S/c1-10(19)18-16-8-12-6-11-7-13(20-2)4-5-14(11)15(12)9-17(16)21-3/h4-5,7-9,18H,6H2,1-3H3
charge 0 multiplicity 1
38 atoms
S  -3.176318 -2.75149 -0.549479
O  5.936453 0.25176 -0.01399
O  -4.050736 2.475518 0.326907
N  -3.863006 0.178583 -0.141123
C  1.019554 1.70997 0.175945
C  -0.157141 0.753702 0.016619
C  0.32575 -0.57494 -0.187538
C  2.228709 0.789719 0.041229
C  1.797345 -0.552517 -0.17379
C  -1.527304 1.04319 0.043294
C  -0.592405 -1.632855 -0.359662
C  3.595208 1.116987 0.103283
C  2.753312 -1.58468 -0.33011
C  -2.458383 -0.021797 -0.132192
C  -1.975137 -1.358409 -0.320979
C  4.543605 0.071306 -0.054312
C  4.123129 -1.269324 -0.269969
C  -4.583185 1.353537 0.06682
C  -3.385943 -3.274969 1.263913
C  6.439142 1.608984 0.205382
C  -6.09841 1.194032 -0.043479
H  0.996826 2.227817 1.154802
H  1.011227 2.501238 -0.599024
H  -1.912685 2.053796 0.194159
H  -0.257017 -2.661797 -0.524644
H  3.910781 2.151785 0.268479
H  2.442621 -2.621785 -0.498193
H  4.892869 -2.038129 -0.386498
H  -4.389989 -0.679783 -0.358595
H  -4.119004 -4.096948 1.269928
H  -3.755917 -2.427982 1.861239
H  -2.418791 -3.624675 1.653586
H  6.104149 2.010574 1.181899
H  6.120917 2.293269 -0.605451
H  7.534915 1.514256 0.200656
H  -6.471703 1.863214 -0.838098
H  -6.563249 1.522069 0.902355
H  -6.424289 0.163073 -0.264469
