program: Gaussian 09
title: 000178965
version: EM64L-G09RevD.01
frameworkgroup: C1[X(C14H17Cl2N3O3S)]
method: RPBEPBE
basis: SDD
operation: Freq
keyword: #p
keyword: freq=noraman
keyword: PBEPBE/SDD
title: #p freq=noraman PBEPBE/SDD
converged: YES YES NO NO
title: Mulliken charges:
elementType: Cl Cl S O O O N N N C C C C C C C C C C C C C C H H H H H H H H H H H H H H H H H
charge: -0.011680 -0.023585 0.892948 -0.511907 -0.255570 -0.222132 -0.498439 -0.534394 -0.299484 0.326739 -0.352746 -0.707093 -0.735848 0.361710 -0.720522 0.273653 0.589831 -0.581245 -0.259546 -0.279775 -0.199269 -0.209052 -0.104019 0.194392 0.257266 0.268270 0.225059 0.210228 0.251189 0.224876 0.212126 0.216482 0.214405 0.228672 0.242847 0.242401 0.261460 0.261882 0.284908 0.264958
chargesum: 0.00000
title: Mulliken charges with hydrogens summed into heavy atoms:
elementType: Cl Cl S O O O N N N C C C C C C C C C C C C C C
charge: -0.011680 -0.023585 0.892948 -0.511907 -0.255570 -0.222132 -0.498439 -0.534394 -0.299484 0.326739 0.098912 -0.003535 -0.047656 0.361710 -0.060963 0.273653 0.589831 0.165463 -0.259546 -0.017892 0.085638 0.055906 -0.104019
polarizability: 3.46503033e+02 1.17401948e+00 2.14675856e+02 1.72683244e+01 4.78230132e+00 1.63030896e+02
1716.lowfreq: -5.2800 0.0021 0.0024 0.0035 3.6412 6.9921 22.3364 26.0192 35.8872
frequency: 21.8988 25.9005 35.7402 39.5726 52.7242 61.2155 82.2406 89.7146 102.4029 119.8286 144.3181 160.3488 163.6405 171.8641 178.7193 194.3112 217.0443 227.8578 234.0684 254.0643 263.9572 280.4258 302.3394 304.9734 314.8179 341.5208 346.1224 359.1646 361.9142 367.1326 377.1562 394.6566 409.0614 449.4294 458.8066 482.8746 497.2051 505.7044 545.0833 557.9240 646.2544 676.5275 688.0016 701.3234 717.9063 739.1318 756.7967 786.5876 807.2375 837.2259 856.3677 865.5304 868.8745 909.7102 919.6848 940.3523 953.5222 980.0751 994.7022 1016.2888 1029.8337 1058.3726 1068.7189 1080.5486 1113.2855 1123.6991 1139.8397 1158.8917 1169.6550 1196.9456 1220.7349 1227.3951 1241.2967 1275.7594 1291.2591 1338.2233 1351.1743 1359.7442 1376.1582 1383.1614 1390.1575 1409.4520 1434.4176 1452.6684 1456.6618 1460.0802 1463.7737 1468.6325 1479.1634 1479.7106 1481.8526 1484.9705 1494.7644 1557.7302 1570.0546 1582.1312 1603.4302 2977.1425 2990.8474 2994.5747 3004.3265 3019.5916 3056.8749 3073.4337 3083.4219 3087.7802 3098.8788 3113.8535 3116.0780 3118.3573 3147.2864 3163.5672 3183.7643 3186.1834
redmass: 5.9929 4.5816 4.6202 7.3327 4.9525 3.2126 6.8917 1.1368 3.8281 7.6437 9.2427 5.4503 2.1727 7.4002 6.6227 4.4885 1.1797 1.6134 7.9604 4.4802 5.5624 4.9822 2.2451 1.8517 5.6173 2.9028 3.9986 4.5774 5.0736 3.8012 7.4601 6.6491 4.2026 3.7866 5.1989 6.8075 3.2828 3.2641 5.9653 5.1673 7.4255 11.8839 4.9909 6.1396 10.2483 4.5875 2.6629 1.3301 1.7324 5.7617 3.6026 1.4667 4.4962 3.6241 4.0087 1.5462 1.4093 2.5148 1.3001 1.6401 3.8428 1.4736 2.2180 2.5576 3.4287 1.5811 1.4116 3.8393 2.6304 2.5581 2.5403 2.5320 1.3705 4.9221 1.3856 1.4116 4.5875 4.5982 1.1921 5.2441 1.2199 1.1978 1.2017 1.0575 1.2944 1.9369 1.1386 1.0564 1.0748 1.0569 1.0500 1.0468 1.0592 8.5408 7.1678 7.1870 9.8887 1.0364 1.0551 1.0451 1.0372 1.0344 1.0968 1.0986 1.0993 1.0989 1.0989 1.1002 1.1004 1.1002 1.1037 1.0893 1.0961 1.0951
irintensity: 0.2784 0.1179 0.5484 0.1568 0.3077 1.2199 0.1290 0.4072 3.7678 1.2684 0.9797 0.5985 1.6691 1.4601 0.4695 0.5019 0.3405 0.3164 1.4297 1.2951 2.0104 4.9256 8.2337 1.4231 16.8510 0.7429 3.7505 16.6158 9.8331 7.5232 1.1275 23.1422 15.8943 13.5744 15.7673 5.4179 4.5498 4.2404 9.6626 9.2738 1.2367 25.4723 0.4547 13.7981 22.5141 21.4566 8.9333 19.2380 14.8285 19.1356 12.0491 16.2323 24.7944 31.2611 46.4856 0.3478 2.6158 52.2923 3.6830 16.2772 29.9965 3.2712 3.4165 54.9686 18.0087 23.5884 2.0875 13.5784 39.6488 84.3159 43.7667 20.9102 4.7168 108.5689 29.1852 3.7853 3.3214 170.9101 31.5006 32.9646 24.5827 12.9183 108.7441 0.6184 35.1115 190.7166 6.7023 4.8879 4.1711 18.2821 11.7034 9.3388 32.6896 25.4266 253.9114 86.1266 269.4983 22.9742 6.7516 40.6853 22.7471 26.5312 14.1709 47.5435 30.0658 21.5053 36.3511 15.9489 14.1985 9.6327 3.1456 1.0740 0.1981 1.4420
temp: 298.150 k
press: 1.00000 atm
elementType: 17 17 16 8 8 8 7 7 7 6 6 6 6 6 6 6 6 6 6 6 6 6 6 1 1 1 1 1 1 1 1 1 1 1 1 1 1 1 1 1
symmnumber: 1
zpe: 771891.3 jmol-1
zpe.correction: 0.293998 hartree
zpe.thermalcorrener: 0.319036 hartree
zpe.thermalcorrenthalpy: 0.319980 hartree
zpe.thermalcorrgfe: 0.237604 hartree
zpe.sumelectzpe: -2249.997256 hartree
zpe.sumelectthermal: -2249.972218 hartree
zpe.sumelectthermalent: -2249.971273 hartree
zpe.sumelectthermalfe: -2250.053650 hartree
dipole: -0.9649 -0.5879 2.2965
dipole: 2.5594
quadrupole: -155.7524 -156.6272 -157.1388
quadrupole: 5.0458 -2.3202 12.1305
quadrupole: 0.7538 -0.1211 -0.6327 5.0458 -2.3202 12.1305
hfenergy: -2250.2912537 hartree
pointgroup: C01 [X(C14H17Cl2N3O3S1)]
dipole: -0.3787427 -0.4138063 0.8362231 debye
polarizability: 346.5930215|-11.0664616|210.4992047|12.0407589|15.3984851|167.1175589 unknown
InChI: InChI=1S/C14H17Cl2N3O3S/c1-5-14(2,3)19-13(21)17(4)12(20)18(23(19)22)11-7-6-9(15)8-10(11)16/h6-8H,5H2,1-4H3
charge 0 multiplicity 1
40 atoms
Cl 1.017803 -1.243807 -1.986916
Cl 6.26391 -1.277262 -0.23932
S  -0.678453 -0.520492 1.415862
O  0.025093 -1.971155 1.325937
O  -3.38486 1.561535 -0.564745
O  0.848878 2.915917 0.068157
N  -2.032682 -0.238449 0.079868
N  0.562565 0.621043 0.431713
N  -1.32109 2.056459 0.429112
C  -2.952192 -1.310544 -0.485769
C  -4.368596 -1.208563 0.171967
C  -3.055764 -1.079851 -2.018557
C  -2.349666 -2.716389 -0.245589
C  -2.31082 1.119403 -0.061133
C  -4.390952 -1.263744 1.712953
C  0.099766 1.924839 0.286068
C  1.899071 0.196081 0.257097
C  -1.808395 3.459118 0.53715
C  2.256851 -0.703702 -0.783485
C  2.920955 0.639263 1.140462
C  3.577993 -1.162725 -0.943366
C  4.2521 0.209058 0.994618
C  4.555617 -0.695998 -0.043862
H  -4.96208 -2.050439 -0.237161
H  -4.844224 -0.273946 -0.170563
H  -3.495665 -0.097085 -2.247523
H  -2.059775 -1.150218 -2.488844
H  -3.702344 -1.864712 -2.452038
H  -1.335874 -2.807084 -0.667312
H  -2.298432 -2.993432 0.819778
H  -3.006191 -3.445151 -0.752255
H  -3.960565 -2.202042 2.108207
H  -3.835338 -0.414836 2.154162
H  -5.430542 -1.197323 2.081223
H  -1.095156 4.027259 1.15154
H  -2.803606 3.451088 1.004896
H  -1.885655 3.933681 -0.455215
H  2.653849 1.345984 1.931609
H  3.835322 -1.855099 -1.748177
H  5.034541 0.563119 1.670454
