program: Gaussian 09
title: 000178975
version: EM64L-G09RevD.01
frameworkgroup: C1[X(C22H26N4O3)]
method: RPBEPBE
basis: SDD
operation: Freq
keyword: #p
keyword: freq=noraman
keyword: PBEPBE/SDD
title: #p freq=noraman PBEPBE/SDD
converged: YES YES NO NO
title: Mulliken charges:
elementType: O O O N N N N C C C C C C C C C C C C C C C C C C C C C C H H H H H H H H H H H H H H H H H H H H H H H H H H
charge: -0.271967 -0.359831 -0.190904 -0.036711 -0.134550 -0.358452 -0.006789 0.176741 -0.628640 0.440562 -0.363110 -0.011419 -0.582849 -0.541582 -0.391634 0.209973 0.513381 -0.508831 -0.435308 -0.333736 0.353971 -0.684058 -0.388943 -0.429685 -0.381709 -0.343923 0.102952 0.091955 -0.793221 0.289278 0.196106 0.219193 0.212237 0.261108 0.198285 0.215251 0.230538 0.224592 0.223567 0.239114 0.222360 0.237597 0.246675 0.220152 0.208161 0.227498 0.237476 0.230025 0.250217 0.250287 0.358759 0.231506 0.237727 0.260570 0.360039
chargesum: 0.00000
title: Mulliken charges with hydrogens summed into heavy atoms:
elementType: O O O N N N N C C C C C C C C C C C C C C C C C C C C C C
charge: -0.271967 -0.001072 -0.190904 -0.036711 -0.134550 0.001587 -0.006789 0.176741 -0.143257 0.440562 0.068320 -0.011419 -0.123456 -0.095793 0.056525 0.209973 0.513381 -0.269717 0.024649 -0.087060 0.353971 -0.028248 -0.151467 -0.199660 -0.131493 -0.093636 0.102952 0.091955 -0.063419
polarizability: 4.04355014e+02 1.99014738e+01 2.41208454e+02 8.84741845e+00 -1.43081132e+01 2.19321430e+02
1716.lowfreq: -8.2728 -3.5961 -0.0015 -0.0008 0.0005 4.1879 5.6741 12.7326 15.3820
frequency: -3.5672 12.5645 15.3393 20.2490 26.9212 30.7099 39.5283 46.9335 57.8081 67.2910 71.8789 92.6276 107.2690 109.5733 137.6235 162.0223 164.5679 176.7865 195.5923 199.8442 226.6738 236.1482 265.0064 274.9365 300.3570 321.1468 327.0504 343.5111 369.3473 372.5383 383.3242 387.9748 396.4665 412.3586 432.0955 446.4993 500.5715 514.4618 530.0991 539.6522 559.5458 578.3346 608.3608 632.2640 635.0904 641.8410 645.6034 660.6575 714.9468 720.3118 732.8189 740.5773 741.8920 757.8833 785.1178 797.0035 810.5181 815.7618 834.8402 841.6648 848.7808 859.2171 865.6646 895.7588 919.8469 933.3203 937.7327 944.6418 950.3505 954.2032 964.0745 972.2320 985.4314 1003.8746 1009.6100 1015.0217 1019.8501 1021.8570 1048.6579 1053.1283 1089.9447 1093.7037 1101.9327 1110.7684 1112.1754 1130.1043 1151.0140 1164.0453 1169.4007 1174.5981 1189.6330 1203.6320 1207.6134 1215.7507 1220.6226 1254.0264 1270.3250 1273.4172 1274.6921 1276.7069 1283.8852 1286.9200 1309.1837 1310.6303 1316.1189 1340.2215 1346.9319 1360.1768 1366.2385 1382.9704 1387.7336 1396.4827 1401.1311 1414.9480 1415.9910 1444.9397 1449.8823 1462.2873 1464.6658 1472.7566 1475.0924 1477.1515 1478.7669 1486.3801 1487.6903 1489.3522 1500.4968 1521.4768 1574.8437 1583.6044 1598.7160 1617.2945 1621.8847 2926.9121 2955.6542 2975.2423 2980.0534 2982.4312 2983.4806 2990.2559 3003.0720 3017.6831 3023.5384 3034.4378 3060.1409 3063.2548 3071.8699 3072.8191 3073.6978 3078.7936 3118.9702 3122.5200 3124.3881 3135.9302 3158.7776 3163.9422 3170.0871 3535.6865 3606.6592
redmass: 5.3680 7.0388 6.0265 6.4957 5.7905 3.9466 4.3356 3.7329 4.6587 4.2401 6.0419 1.7579 4.5191 4.0646 4.3584 1.0702 2.8142 4.9269 3.8895 4.7540 1.2354 4.5167 4.3748 3.0240 3.4537 2.8749 2.4939 2.8629 3.8390 3.0892 3.1334 2.7710 1.8989 2.9661 3.8870 4.0845 3.6599 3.0829 3.0510 4.6511 3.8169 4.3338 4.3756 5.7995 6.3969 4.0562 3.5645 4.2806 4.0144 1.2393 3.7650 1.2272 2.6208 3.3652 2.6675 2.3604 1.6904 1.5331 1.8062 1.9980 2.3660 2.3436 1.7108 2.1970 5.2653 1.5264 1.9690 3.1967 9.8451 1.7971 1.3966 2.4009 1.8182 2.7305 7.7343 1.7241 1.8358 2.0120 2.9579 2.8287 2.0772 6.8336 2.3103 1.4513 1.7547 2.0944 2.2078 1.7840 1.6006 1.4362 1.3600 1.6577 1.8696 1.4417 3.1194 2.6218 1.6120 1.6279 1.6539 1.2961 1.6859 1.3748 1.3282 1.2549 1.3258 1.4579 1.4313 1.5766 1.2653 3.8416 3.5097 1.2131 1.5903 4.1466 3.8943 1.5464 1.0962 1.3412 1.0528 1.7048 1.0807 1.0706 1.1199 1.1183 1.3323 1.8271 2.2602 1.1230 6.8933 6.9569 7.6236 7.2542 6.5091 1.0728 1.0578 1.0361 1.0610 1.0608 1.0378 1.0612 1.0633 1.1042 1.0994 1.0977 1.1032 1.0918 1.0965 1.0978 1.1005 1.0991 1.0892 1.0994 1.0893 1.0890 1.0937 1.0953 1.0944 1.0646 1.0845
irintensity: 0.3038 0.2902 1.2273 4.1044 5.7599 0.4025 0.4300 0.5667 0.8331 0.0904 1.0476 0.0201 1.8471 1.3322 1.2596 0.5192 3.4107 0.2376 5.2869 0.8425 0.4614 0.5735 2.5954 1.1821 1.8843 0.9675 5.1738 6.9412 16.5758 0.8086 28.0085 16.3016 46.1588 0.0652 8.8811 9.8453 4.3544 1.7048 24.0366 5.6177 7.3125 10.3894 1.3772 0.8666 12.6294 3.4230 3.4341 3.7173 5.0681 114.9229 14.9838 3.8371 12.2922 23.2213 6.9252 17.3756 34.2101 7.8654 24.6646 52.9364 10.5282 6.9441 6.6180 12.8024 12.4698 3.2800 9.2539 143.3015 11.3859 17.8810 0.8104 6.7819 15.4646 8.7549 1.1016 3.3713 1.6691 3.4269 1.7273 5.0128 10.0176 16.0065 94.9954 12.6305 17.4699 12.9851 5.9101 34.2406 53.3063 158.9875 8.8677 60.6895 209.3246 22.4289 35.1805 95.6312 104.7292 10.0917 16.3991 1.3058 7.3945 1.7367 1.5535 1.8295 2.4724 1.9772 9.5347 30.9936 29.7115 34.3889 76.5378 13.6992 11.8811 15.8329 12.9068 29.0047 20.4698 14.4857 18.4448 16.3314 6.4679 18.7430 9.9355 23.5594 62.1094 50.7965 108.0213 13.4655 75.6114 21.9452 139.0480 28.7061 45.9002 25.8221 33.0851 37.1978 22.0978 4.7364 4.7216 48.3883 16.5271 30.6342 8.0410 4.1426 35.4212 7.8392 14.5888 52.5775 13.4629 41.7222 20.6039 19.1651 22.6545 8.3405 18.3052 3.8530 11.1183 24.9102 111.6393
temp: 298.150 k
press: 1.00000 atm
elementType: 8 8 8 7 7 7 7 6 6 6 6 6 6 6 6 6 6 6 6 6 6 6 6 6 6 6 6 6 6 1 1 1 1 1 1 1 1 1 1 1 1 1 1 1 1 1 1 1 1 1 1 1 1 1 1
symmnumber: 1
zpe: 1162859.3 jmol-1
zpe.correction: 0.442910 hartree
zpe.thermalcorrener: 0.470701 hartree
zpe.thermalcorrenthalpy: 0.471645 hartree
zpe.thermalcorrgfe: 0.379314 hartree
zpe.sumelectzpe: -1296.427825 hartree
zpe.sumelectthermal: -1296.400033 hartree
zpe.sumelectthermalent: -1296.399089 hartree
zpe.sumelectthermalfe: -1296.491420 hartree
dipole: 5.0260 -2.3566 2.2769
dipole: 5.9998
quadrupole: -197.4310 -166.2013 -158.7359
quadrupole: -5.0625 -17.7810 1.1788
quadrupole: -23.3083 7.9214 15.3868 -5.0625 -17.7810 1.1788
hfenergy: -1296.8707343 hartree
pointgroup: C01 [X(C22H26N4O3)]
dipole: -1.9767546 -0.8140382 -1.0009131 debye
polarizability: 404.2416721|-21.1545297|237.7324497|6.938069|16.3700564|222.9107764 unknown
InChI: InChI=1S/C22H26N4O3/c1-3-5-20-17(10-13-19(15(2)27)22(20)28)14-29-18-11-8-16(9-12-18)6-4-7-21-23-25-26-24-21/h8-13,25,28H,3-7,14H2,1-2H3
charge 0 multiplicity 1
55 atoms
O  0.915534 -0.347316 -0.056106
O  5.906181 1.171219 1.409394
O  8.146426 -0.325109 1.074384
N  -8.503959 -1.280776 0.733824
N  -7.63598 0.847214 0.757811
N  -8.88244 -0.560421 1.836095
N  -8.378206 0.731485 1.887728
C  3.911607 0.507527 0.155447
C  3.228673 1.808438 0.557042
C  3.265313 -0.453578 -0.6665
C  3.673736 3.028327 -0.303753
C  5.249569 0.251992 0.590023
C  -4.747379 0.522977 -0.821732
C  1.863191 -0.223034 -1.188682
C  -5.483063 -0.819551 -1.090458
C  5.951192 -0.939531 0.219312
C  -3.248291 0.327312 -0.652802
C  3.9425 -1.643213 -1.0300
C  -7.026309 -0.669884 -1.22499
C  5.254584 -1.878396 -0.588981
C  -0.448544 -0.116374 -0.333323
C  3.005742 4.341076 0.155287
C  -2.69616 -0.000877 0.615977
C  -2.361726 0.42439 -1.751472
C  -1.3166 -0.221391 0.781636
C  -0.970835 0.207214 -1.609037
C  7.371014 -1.218365 0.630804
C  -7.7180 -0.372661 0.071022
C  7.88615 -2.656032 0.479043
H  2.134677 1.690357 0.48603
H  3.405808 2.038804 1.632369
H  4.776364 3.135482 -0.277266
H  3.41581 2.82832 -1.362217
H  -5.180709 0.999247 0.076903
H  -4.949783 1.209067 -1.667903
H  1.757605 0.786952 -1.636608
H  1.612557 -0.976238 -1.961002
H  -5.094717 -1.262032 -2.028206
H  -5.249742 -1.54007 -0.282794
H  3.433065 -2.385248 -1.654141
H  -7.247807 0.138951 -1.946901
H  -7.455385 -1.604427 -1.627061
H  5.758081 -2.802388 -0.886218
H  1.903408 4.265076 0.106308
H  3.277156 4.586847 1.199699
H  3.314936 5.190158 -0.480403
H  -3.358044 -0.07435 1.487667
H  -2.75945 0.681311 -2.741375
H  -0.889143 -0.469664 1.758133
H  -0.321829 0.294236 -2.485468
H  5.289589 1.906124 1.66095
H  8.019294 -2.919624 -0.587757
H  7.196801 -3.394176 0.926479
H  8.867138 -2.720221 0.974045
H  -9.4923 -0.939656 2.559741
