program: Gaussian 09
title: 000178971
version: EM64L-G09RevD.01
frameworkgroup: C1[X(C19H19NO6)]
method: RPBEPBE
basis: SDD
operation: Freq
keyword: #p
keyword: freq=noraman
keyword: PBEPBE/SDD
title: #p freq=noraman PBEPBE/SDD
converged: YES YES NO NO
title: Mulliken charges:
elementType: O O O O O O N C C C C C C C C C C C C C C C C C C C H H H H H H H H H H H H H H H H H H H
charge: -0.284581 -0.283882 -0.264639 -0.227775 -0.220668 -0.233020 -0.438804 -0.011233 0.497514 0.310338 0.305767 0.071052 -0.396212 -0.387316 -0.453936 -0.328766 0.341459 -0.178254 -0.330544 -0.374774 -0.244374 -0.684870 0.262984 0.266934 -0.743690 -0.742892 0.366476 0.256611 0.255711 0.237211 0.307230 0.238194 0.245896 0.250022 0.206977 0.206356 0.232115 0.232335 0.206446 0.266775 0.247470 0.251527 0.266181 0.248180 0.252466
chargesum: 0.00000
title: Mulliken charges with hydrogens summed into heavy atoms:
elementType: O O O O O O N C C C C C C C C C C C C C C C C C C C
charge: -0.284581 -0.283882 -0.264639 -0.227775 -0.220668 -0.233020 -0.072328 -0.011233 0.497514 0.310338 0.305767 0.071052 -0.139600 -0.131605 -0.216724 -0.021535 0.341459 0.059940 -0.084649 -0.124752 0.168959 -0.013974 0.262984 0.266934 0.022082 0.023936
polarizability: 3.52054055e+02 5.57801480e-01 2.03962085e+02 8.51805722e+00 -4.71129625e+00 1.76235179e+02
1716.lowfreq: -19.4885 -0.0010 -0.0005 0.0003 1.2923 4.5900 5.6508 17.6028 31.7019
frequency: -18.4768 17.4383 31.6645 38.3690 43.4311 56.0904 60.4144 61.5630 72.0958 83.9866 91.9234 95.3797 112.1031 117.5867 119.5937 141.4047 147.5479 172.3778 215.1394 244.8938 245.5412 261.8450 289.5055 293.2916 323.5681 345.8181 375.2206 380.0554 414.8929 415.4375 425.7380 463.6975 510.4048 512.8265 526.3204 534.4384 552.8371 562.3755 566.1957 580.7527 627.9242 651.9296 664.4126 680.6569 693.9745 705.3759 724.3099 742.2628 758.3310 796.0953 804.9758 811.5306 820.5750 832.6363 850.9516 858.0051 873.8701 902.9187 905.6873 930.8011 956.6998 976.2180 983.1291 991.7700 994.1109 1000.2632 1038.1492 1041.2617 1041.5110 1051.0971 1098.5344 1115.5780 1125.1330 1136.1372 1157.1908 1168.8344 1173.6950 1182.6519 1207.7171 1216.0614 1218.7064 1238.0541 1262.6023 1276.0615 1308.2514 1361.6018 1370.3558 1378.5239 1385.3391 1385.9085 1400.1689 1425.0808 1437.9521 1443.8194 1450.7909 1451.5574 1452.0205 1452.1720 1460.8670 1477.4647 1487.7789 1503.0015 1524.9310 1576.7138 1586.3388 1605.2659 1613.5466 1629.0699 1670.3044 1677.7981 2950.2083 2996.6911 3007.0807 3009.6059 3009.9706 3093.9950 3099.4453 3100.3947 3105.7180 3128.0387 3145.4209 3145.5077 3150.7545 3160.1556 3165.3984 3170.1321 3182.3044 3192.7053 3485.7935
redmass: 5.2512 3.9315 2.9228 4.5852 2.1420 4.4121 2.6374 5.4820 2.6165 2.6059 2.2872 2.1177 6.0854 1.8264 4.5386 6.1846 7.2106 5.2794 5.4878 1.4816 2.7775 7.8714 4.0610 4.7145 3.4774 7.4040 5.6184 4.7493 3.0734 5.5293 4.4420 4.8518 4.8854 4.4171 2.7736 4.6833 3.5956 3.7591 4.1268 4.6573 6.9764 6.6416 1.4139 4.4436 5.9210 6.1544 3.8116 2.8283 2.5213 4.4221 1.4020 2.8110 6.0632 1.1206 1.5042 6.2013 7.1785 3.2575 1.4605 1.3883 4.7464 1.3380 1.3109 2.0323 2.3750 2.7979 2.8414 1.6501 1.6549 2.9315 2.3338 2.1124 1.3555 1.4376 1.9691 1.4873 3.3398 1.2866 5.6675 1.9032 2.5235 3.6788 1.1421 2.1612 1.4360 1.7832 10.4626 2.6073 1.2340 1.2365 1.2976 4.0508 2.5580 3.3474 1.0631 1.0599 1.0577 1.0584 1.0400 1.0835 1.1813 2.0202 2.4410 7.3983 9.5774 3.1586 8.1763 6.4061 9.9805 10.1072 1.0553 1.0362 1.1073 1.0372 1.0373 1.0989 1.0963 1.0961 1.1013 1.0897 1.1019 1.1018 1.0872 1.0904 1.0941 1.0927 1.0997 1.0955 1.0773
irintensity: 5.9004 0.8774 1.9616 0.3416 3.2197 2.6865 4.2183 2.1839 2.2147 1.9549 1.3805 0.1215 4.2565 3.5736 3.8649 0.4809 2.0119 6.0519 0.0757 0.0308 1.7537 5.0100 3.7802 1.3791 0.5196 9.9002 3.3268 0.6298 0.0205 5.7964 7.0690 0.4864 3.4012 1.4579 46.6551 0.0598 21.4495 3.7795 2.5210 16.5877 0.6477 4.0585 51.9074 1.5657 10.2190 9.6331 1.0867 17.8488 28.8820 5.2987 51.3576 23.2430 8.6363 0.0685 59.2504 33.9339 31.2046 47.5393 0.9541 0.1777 90.2999 2.0493 0.0897 60.4980 220.4419 3.4098 89.4957 2.6155 19.0057 7.9710 6.5930 2.9073 20.9736 4.0172 312.5316 118.9931 243.0424 145.0548 2.3533 5.1360 278.4935 84.5233 0.0378 8.3504 4.4813 5.4807 9.9085 98.2564 82.3959 39.9393 60.1371 6.9831 57.5124 1.5701 20.2963 14.8177 9.9479 35.7820 11.7780 53.4250 78.8086 107.1882 392.3724 24.8081 169.0470 41.0066 35.1346 11.4195 86.1623 268.6673 43.6386 30.1820 37.9812 0.4653 0.3954 29.8596 6.1080 6.0516 34.0579 14.4555 5.1217 8.6730 5.2460 5.3550 12.3727 4.2873 10.1195 5.1886 33.0277
temp: 298.150 k
press: 1.00000 atm
elementType: 8 8 8 8 8 8 7 6 6 6 6 6 6 6 6 6 6 6 6 6 6 6 6 6 6 6 1 1 1 1 1 1 1 1 1 1 1 1 1 1 1 1 1 1 1
symmnumber: 1
zpe: 900836.5 jmol-1
zpe.correction: 0.343111 hartree
zpe.thermalcorrener: 0.368434 hartree
zpe.thermalcorrenthalpy: 0.369378 hartree
zpe.thermalcorrgfe: 0.285042 hartree
zpe.sumelectzpe: -1239.647883 hartree
zpe.sumelectthermal: -1239.622560 hartree
zpe.sumelectthermalent: -1239.621615 hartree
zpe.sumelectthermalfe: -1239.705952 hartree
dipole: -0.3551 0.6193 -2.5237
dipole: 2.6228
quadrupole: -117.2871 -128.0269 -163.8343
quadrupole: -0.9810 5.3644 0.8738
quadrupole: 19.0957 8.3558 -27.4516 -0.9810 5.3644 0.8738
hfenergy: -1239.9909931 hartree
pointgroup: C01 [X(C19H19N1O6)]
dipole: 0.1268599 0.213974 1.001447 debye
polarizability: 351.8627198|1.0182905|203.6404732|10.1953771|5.6954501|176.7481257 unknown
InChI: InChI=1S/C19H19NO6/c1-4-24-15-10-8-14(9-11-15)20-19(23)18-16(25-12(2)21)6-5-7-17(18)26-13(3)22/h5-11,20H,4H2,1-3H3
charge 0 multiplicity 1
45 atoms
O  -2.613466 -2.425698 -0.390948
O  -2.378041 2.500817 -0.37933
O  5.623253 0.010735 -0.380652
O  -0.776556 -0.184638 -2.130193
O  -1.322492 -2.275472 1.564939
O  -1.231169 2.309809 1.659549
N  -0.020997 0.067286 0.088504
C  -2.419953 0.033085 -0.356737
C  1.396297 0.046429 -0.057453
C  -3.199268 -1.136775 -0.188429
C  -3.084625 1.269064 -0.178632
C  -0.992082 -0.038503 -0.887319
C  -4.57303 -1.09086 0.110771
C  -4.457201 1.353346 0.119465
C  2.176795 0.152063 1.120792
C  2.049086 -0.070006 -1.317361
C  4.231292 0.029525 -0.196201
C  -5.204249 0.16365 0.254434
C  3.585377 0.143766 1.060977
C  3.453418 -0.077361 -1.375775
C  6.475531 0.118679 0.81852
C  7.923801 0.075064 0.338067
C  -1.648743 -2.905674 0.542601
C  -1.452735 2.939657 0.607614
C  -1.12365 -4.239199 0.073789
C  -0.813074 4.229147 0.158689
H  -0.374581 0.15732 1.047924
H  -5.126478 -2.027328 0.222736
H  -4.920219 2.337297 0.23543
H  1.680683 0.240653 2.094969
H  1.450798 -0.154641 -2.226299
H  -6.274216 0.213678 0.478784
H  4.156929 0.224457 1.989856
H  3.970439 -0.166118 -2.33621
H  6.254114 -0.723991 1.506288
H  6.255346 1.070401 1.345641
H  8.130098 0.910622 -0.3523
H  8.129188 -0.870819 -0.191508
H  8.612427 0.152313 1.199178
H  -0.516283 -4.091256 -0.837034
H  -0.501136 -4.692258 0.858476
H  -1.95629 -4.910671 -0.193067
H  -0.139098 4.02328 -0.692142
H  -0.232859 4.664762 0.984667
H  -1.578485 4.940363 -0.192469
