program: Gaussian 09
title: 000178931
version: EM64L-G09RevD.01
frameworkgroup: C1[X(C15H24O2)]
method: RPBEPBE
basis: SDD
operation: Freq
keyword: #pfreq=noraman
keyword: PBEPBE/SDD
title: #p freq=noraman PBEPBE/SDD
converged: NO YES NO NO
title: Mulliken charges:
elementType: O O C C C C C C C C C C C C C C C H H H H H H H H H H H H H H H H H H H H H H H H
charge: -0.459056 -0.194322 0.271560 0.218601 -0.117340 -0.595988 -0.559872 -0.128172 -0.487266 -0.416568 0.145925 -0.553407 -0.782628 -0.766407 0.487781 -0.833593 -0.738368 0.231624 0.233627 0.222489 0.242482 0.221961 0.196335 0.225487 0.202699 0.198309 0.252342 0.220503 0.248934 0.231956 0.236326 0.221136 0.230228 0.213881 0.225380 0.328221 0.231137 0.223656 0.227351 0.214128 0.228927
chargesum: 0.00000
title: Mulliken charges with hydrogens summed into heavy atoms:
elementType: O O C C C C C C C C C C C C C C C
charge: -0.130835 -0.194322 0.271560 0.218601 0.114284 -0.139872 -0.095428 0.068163 -0.059079 0.034083 0.145925 -0.083970 -0.093211 -0.096918 0.487781 -0.151449 -0.295313
polarizability: 1.84289348e+02 5.41571221e+00 1.58576210e+02 -7.78233828e+00 -3.40927890e+00 1.35044611e+02
1716.lowfreq: -19.6078 -12.6581 -0.0005 -0.0001 0.0006 19.0619 35.0294 63.0904 80.1844
frequency: 34.6611 63.0807 80.1714 119.8863 126.2095 132.3673 160.4831 169.8563 192.2152 208.1765 215.2024 233.3195 266.3886 271.7828 294.8998 315.7142 341.4679 344.9045 356.6110 379.9611 412.4248 440.1913 452.3139 464.1769 480.3814 500.0460 510.2143 543.9715 552.3270 592.4913 633.9924 699.1044 714.1639 776.2805 785.4211 803.9620 824.5621 844.4909 882.9986 903.2044 917.0715 931.4846 938.0672 946.8117 959.1122 980.0497 988.5486 1001.9949 1009.7738 1024.8851 1032.8913 1046.9309 1071.1996 1083.8366 1099.6309 1113.4875 1140.4025 1144.8817 1160.8316 1171.9515 1183.5013 1208.4878 1232.0453 1239.1239 1253.2820 1255.8176 1264.6305 1297.4784 1300.8711 1308.0076 1315.3465 1324.0740 1329.2830 1336.4350 1352.9191 1364.2315 1384.6804 1394.5256 1396.1936 1426.8871 1446.4896 1451.2392 1463.9175 1465.1945 1466.4770 1473.2212 1476.5510 1482.4702 1484.2903 1490.7086 1502.7620 1618.3705 1663.1278 2910.8450 2966.6232 2967.8338 2976.7654 2978.1114 2981.8093 2986.6523 2989.3580 2996.4448 3001.8104 3037.1136 3039.9786 3046.7399 3051.6904 3064.6509 3071.4522 3078.3348 3081.5601 3085.0423 3085.7109 3099.8002 3119.2871 3199.4917 3571.5533
redmass: 2.6849 4.3171 3.3382 2.4255 3.2042 1.4335 1.3102 1.7306 2.1406 3.0336 1.4041 1.6311 2.6904 2.7651 1.9816 3.2661 2.5249 2.5346 2.7793 2.3532 2.8290 2.6767 2.8557 2.5431 2.9023 3.6470 2.9001 2.5408 3.3705 3.0754 3.4600 1.3579 2.1394 2.7145 1.6299 2.2425 2.6894 2.4532 2.5225 1.9315 1.8074 1.3380 1.9617 1.8477 1.7971 1.8571 1.5585 2.0609 1.5865 1.7358 1.6625 1.5795 1.9257 1.8212 1.8552 3.2843 2.2283 1.8915 2.4647 1.5936 2.0371 1.5776 1.6940 1.3872 1.8060 1.8182 1.4222 1.4253 1.2862 1.4844 1.5624 1.5824 1.6759 1.3989 1.4284 1.6835 1.2131 1.2159 1.2045 1.1881 1.0829 1.0851 1.0766 1.0542 1.0622 1.0600 1.0591 1.0638 1.0754 1.0622 1.0566 10.5022 4.8071 1.0801 1.0381 1.0693 1.0810 1.0643 1.0599 1.0405 1.0545 1.0417 1.0659 1.0983 1.0968 1.0950 1.1010 1.0954 1.0984 1.0985 1.0980 1.0986 1.0982 1.0631 1.0952 1.1128 1.0651
irintensity: 0.2164 4.1025 3.8163 2.5834 0.2764 0.1939 0.8696 0.9192 5.2806 4.3936 85.4433 30.4585 1.8926 5.0443 0.2091 8.6920 1.8769 3.7312 1.8353 3.4820 1.3256 3.5654 4.0513 0.8095 0.2950 5.8104 1.9770 12.1252 3.3555 0.3867 0.7921 0.9725 1.8687 1.6727 7.9195 4.1025 12.2559 4.5529 3.1056 13.7454 20.3588 74.6157 8.6888 1.2595 16.6561 3.9777 13.6061 9.6654 5.1850 19.8829 16.4188 5.8908 1.0794 18.5951 7.3920 5.4944 8.4009 23.4066 8.4151 3.5376 1.2027 4.9276 9.1739 13.5860 14.7158 29.6950 10.6916 8.3953 2.6238 6.2320 14.1271 2.6384 18.5755 3.7129 0.8811 0.1586 12.4765 25.2766 25.5915 2.0415 7.3911 21.7744 9.7163 12.7663 16.2555 20.2895 20.5541 2.4493 11.0782 9.2396 15.3601 148.3318 33.6634 21.5955 22.9608 19.2527 12.8586 15.0947 25.2689 8.9364 28.0674 39.4164 55.0364 22.2623 40.5364 25.9515 31.9540 16.1502 51.4316 23.8387 25.6657 31.2274 28.6168 9.8547 27.5352 24.9214 1.3971
temp: 298.150 k
press: 1.00000 atm
elementType: 8 8 6 6 6 6 6 6 6 6 6 6 6 6 6 6 6 1 1 1 1 1 1 1 1 1 1 1 1 1 1 1 1 1 1 1 1 1 1 1 1
symmnumber: 1
zpe: 938645.2 jmol-1
zpe.correction: 0.357511 hartree
zpe.thermalcorrener: 0.375542 hartree
zpe.thermalcorrenthalpy: 0.376487 hartree
zpe.thermalcorrgfe: 0.313321 hartree
zpe.sumelectzpe: -735.078787 hartree
zpe.sumelectthermal: -735.060756 hartree
zpe.sumelectthermalent: -735.059812 hartree
zpe.sumelectthermalfe: -735.122977 hartree
dipole: -1.6284 2.1527 2.0164
dipole: 3.3692
quadrupole: -107.7364 -109.0375 -105.9859
quadrupole: 7.4358 6.3509 -1.7484
quadrupole: -0.1498 -1.4509 1.6007 7.4358 6.3509 -1.7484
hfenergy: -735.4362986 hartree
pointgroup: C01 [X(C15H24O2)]
dipole: 0.6427819 -0.9832867 0.6140685 debye
polarizability: 183.8606356|3.9277868|156.3149526|9.4608178|8.039879|137.7345804 unknown
InChI: InChI=1S/C15H24O2/c1-10(2)12-7-8-14(4)13(16)6-5-11(3)15(14,17)9-12/h11-12,17H,1,5-9H2,2-4H3
charge 0 multiplicity 1
41 atoms
O  -0.454514 -0.058443 -1.834052
O  -2.650594 2.274044 -0.27093
C  -0.386687 -0.479454 -0.395822
C  -0.878221 0.742686 0.477574
C  -1.339264 -1.717392 -0.424731
C  1.082729 -0.839561 -0.062021
C  0.08476 1.947379 0.254872
C  2.053843 0.366865 -0.261668
C  1.560993 1.591661 0.548186
C  -2.765291 -1.269252 -0.852136
C  -2.314603 1.094546 0.018491
C  -3.307343 -0.064979 -0.030943
C  -0.943942 0.446916 2.0092
C  -1.359163 -2.626045 0.828307
C  3.507695 -0.036589 0.012076
C  4.075382 -1.120823 -0.89313
C  4.274764 0.5342 0.979849
H  -0.935736 -2.331824 -1.256051
H  1.379557 -1.678611 -0.718392
H  1.169962 -1.191544 0.983329
H  -0.23998 2.782366 0.901641
H  -0.025174 2.344292 -0.77548
H  2.014601 0.634952 -1.343536
H  2.200169 2.466928 0.323164
H  1.683151 1.387099 1.629891
H  -3.466216 -2.120692 -0.753982
H  -2.736803 -0.977774 -1.915567
H  -3.521326 -0.387946 1.008451
H  -4.254081 0.308955 -0.457354
H  0.0335 0.120629 2.401889
H  -1.229608 1.371622 2.543454
H  -1.678985 -0.329937 2.265846
H  -0.345461 -2.836437 1.212932
H  -1.955686 -2.208024 1.657717
H  -1.816503 -3.596358 0.560571
H  0.016337 0.805147 -1.943267
H  3.608828 -2.105086 -0.694831
H  3.885516 -0.887666 -1.959206
H  5.163857 -1.232606 -0.752472
H  5.316319 0.22656 1.131154
H  3.900717 1.320594 1.64238
