program: Gaussian 09
title: 000178957
version: EM64L-G09RevD.01
frameworkgroup: C1[X(C25H24N6O5)]
method: RPBEPBE
basis: SDD
operation: Freq
keyword: #p
keyword: freq=noraman
keyword: PBEPBE/SDD
title: #p freq=noraman PBEPBE/SDD
converged: YES YES NO NO
title: Mulliken charges:
elementType: O O O O O N N N N N N C C C C C C C C C C C C C C C C C C C C C C C C C H H H H H H H H H H H H H H H H H H H H H H H H
charge: -0.293978 -0.427683 -0.469994 -0.229560 -0.234200 -0.293619 -0.487490 -0.076214 -0.443101 -0.042433 -0.637105 -0.089076 -0.490349 -0.146708 -0.077896 -0.354473 0.332249 0.196627 -0.130821 0.301626 -0.702524 0.486459 0.193320 0.282460 0.199013 -0.552771 -0.016649 -0.388243 -0.508766 0.122508 -0.559163 -0.402890 0.338961 -0.382251 0.086365 -0.794128 0.271667 0.277735 0.260189 0.233635 0.250125 0.247104 0.227285 0.356528 0.314514 0.251608 0.256223 0.389412 0.347839 0.363345 0.240636 0.215110 0.255161 0.238368 0.276094 0.343796 0.340386 0.237325 0.238508 0.259904
chargesum: 0.00000
title: Mulliken charges with hydrogens summed into heavy atoms:
elementType: O O O O O N N N N N N C C C C C C C C C C C C C C C C C C C C C C C C C
charge: -0.293978 -0.071155 -0.106648 -0.229560 -0.234200 -0.293619 -0.172977 -0.076214 -0.053690 -0.042433 0.047076 0.182592 0.047574 0.086927 0.172229 0.119917 0.332249 0.196627 -0.130821 0.301626 -0.194693 0.486459 0.193320 0.282460 0.199013 -0.204933 -0.016649 -0.147607 -0.293656 0.122508 -0.304002 -0.164521 0.338961 -0.106158 0.086365 -0.058391
polarizability: 6.88708361e+02 -8.41441588e+00 3.44913148e+02 2.00937862e+01 3.21265379e+01 1.78242543e+02
1716.lowfreq: -14.0560 -3.8567 -1.9336 -0.0013 -0.0008 0.0004 9.5815 16.5871 26.9125
frequency: 8.5962 15.5365 26.0906 33.9614 39.8814 50.0588 58.5740 70.7455 81.5773 94.9506 103.8072 111.7955 131.2923 145.3216 147.1530 148.2626 162.0023 166.8342 181.2717 195.3922 200.7366 206.2432 220.0477 237.3086 245.6341 266.8719 286.4130 297.3033 310.4455 331.6011 337.0157 345.1317 358.9964 364.9257 379.8297 410.4070 413.4395 419.4128 437.1362 445.5693 459.1797 476.0856 478.2255 489.9350 498.9639 515.0260 516.5305 538.5938 541.2008 557.9824 571.6409 572.9550 585.0393 607.1908 626.9748 630.9286 633.8330 648.4194 662.7636 688.5177 693.2927 702.3614 719.1825 737.7880 749.5994 761.2055 771.5074 776.9374 793.0839 795.8723 814.0230 834.6412 859.4397 862.9648 882.2333 883.7286 898.8688 929.4959 933.8900 939.6667 941.9256 943.6624 945.5831 964.0176 981.3600 993.2024 993.8712 994.2666 1001.9903 1015.6244 1025.8830 1037.3015 1042.5187 1057.5765 1066.2950 1067.6991 1097.0709 1110.1532 1134.0747 1136.2806 1149.9619 1154.3843 1163.9144 1170.8301 1178.5612 1205.5289 1216.4773 1227.5747 1229.5660 1238.7348 1253.4060 1264.5255 1268.2139 1276.6796 1290.7783 1298.4653 1299.6314 1302.2689 1310.4661 1313.2593 1328.6007 1350.2011 1353.4960 1363.8205 1377.4052 1380.0631 1391.3078 1394.2540 1398.4403 1423.7752 1439.6098 1447.4426 1456.5731 1461.8432 1462.0927 1467.2731 1468.1514 1488.3941 1507.2444 1529.5312 1532.0499 1560.2787 1568.6403 1591.3435 1597.0762 1599.5063 1618.9601 1622.5080 1629.4920 1638.3917 2981.8430 2983.8149 2987.3326 2987.9880 3002.4011 3013.3072 3031.1754 3035.9765 3068.1383 3090.4515 3102.1178 3115.1120 3123.4544 3130.5292 3138.2037 3144.4573 3155.9059 3158.0005 3432.4403 3521.1032 3554.1618 3576.0758 3590.4701 3690.2954
redmass: 6.2390 4.7446 5.4300 7.4849 5.6459 6.2439 3.9808 5.4419 5.2371 5.0076 6.8999 6.9820 1.6847 2.5790 1.2362 5.6475 3.8749 5.5092 4.1415 4.5705 5.3236 4.1142 5.4313 2.4672 3.1962 4.6546 5.3048 4.9696 7.6679 3.4629 5.0137 3.6805 4.6202 3.3308 1.7286 3.6261 4.1024 2.5091 1.9644 2.4888 2.5972 1.3886 2.8941 7.1478 3.3239 1.1312 4.3407 3.7756 4.2904 5.8632 4.4855 3.2204 4.9212 5.2179 3.0273 6.7140 5.4671 6.7237 8.3603 6.3591 9.1203 6.2895 3.2276 5.8919 5.8453 8.1968 3.2660 4.6827 3.4759 1.1640 1.5908 5.6813 1.5124 7.0950 4.5133 1.4820 2.5076 3.0948 1.5063 1.3887 4.2808 2.7557 2.3657 3.9602 1.7529 4.2137 1.5464 2.6778 2.9039 2.6421 1.8238 3.1037 2.8048 5.6323 2.2457 2.3475 3.0483 2.2238 1.1621 1.6665 1.3650 1.5122 2.6059 1.9358 1.2336 1.6376 2.9440 1.2932 1.7967 2.9720 1.6839 1.7068 1.5775 1.8657 2.1755 1.4296 1.3982 1.3794 1.6576 2.6019 3.3274 1.4514 1.3567 1.3891 3.1222 6.6222 1.3932 1.2494 3.6973 1.1691 3.7955 1.1744 4.2996 1.0947 1.0502 2.4181 1.1443 3.5779 3.0684 2.4334 5.2657 6.8195 8.4243 6.4307 4.5220 1.5773 7.9185 7.9385 6.8150 4.1904 1.0698 1.0373 1.0613 1.0837 1.0862 1.0858 1.0990 1.0640 1.0969 1.0976 1.0886 1.1031 1.0992 1.0888 1.0911 1.0951 1.0946 1.0955 1.0806 1.0471 1.0756 1.0663 1.0673 1.1036
irintensity: 2.1087 0.1916 4.2724 2.8305 2.8286 4.5096 2.6630 3.2597 3.3091 2.0790 2.1830 3.9705 91.2972 14.6626 5.2962 1.5464 0.3976 8.8073 7.4314 17.5011 3.5622 3.2060 3.2761 19.4126 1.3868 2.1641 2.4851 3.6411 4.8865 21.8605 4.0137 37.1645 6.2647 12.1402 92.4027 0.4625 42.0697 35.3578 46.5383 14.7586 7.3566 81.3061 64.8595 7.5381 1.3202 161.1091 6.8485 13.5059 13.7582 3.9442 0.0963 2.0717 12.6344 12.0142 2.8581 2.5718 2.7030 9.1164 12.4661 5.9835 11.3062 5.5261 11.6760 3.8358 28.4070 31.5447 4.3491 10.8242 6.5423 149.2777 61.6053 9.1624 33.7732 16.8622 0.1005 6.0591 20.6348 40.1126 0.1851 0.9468 63.2500 71.4130 12.8830 83.0231 29.1259 17.5626 16.2162 62.9627 90.8406 25.4666 0.6110 59.6666 23.6450 46.8657 20.8517 2.6758 18.6423 52.7955 0.2004 6.1168 19.9130 9.8250 36.7633 14.4031 19.3294 17.8229 9.1289 28.1843 184.9768 68.3236 21.2769 47.3319 26.3726 42.4866 264.2362 20.0455 9.8099 47.6819 86.5722 265.4931 73.2765 28.9895 1.5526 39.5661 22.9426 25.8955 15.0984 4.6114 328.0734 11.9100 43.7802 37.9776 131.6081 13.5343 19.7759 107.2262 6.3457 83.8934 62.1762 253.6799 141.5785 396.8914 862.0301 437.7823 15.7277 109.0171 132.1331 333.4142 344.0422 263.5424 33.5794 3.5339 6.3868 29.4578 21.6794 40.4983 4.5976 12.2924 13.7614 20.9317 32.6432 5.2497 27.4224 7.2680 8.7357 15.8038 23.4805 7.6883 314.3524 164.9427 18.1999 16.7902 18.3411 81.1942
temp: 298.150 k
press: 1.00000 atm
elementType: 8 8 8 8 8 7 7 7 7 7 7 6 6 6 6 6 6 6 6 6 6 6 6 6 6 6 6 6 6 6 6 6 6 6 6 6 1 1 1 1 1 1 1 1 1 1 1 1 1 1 1 1 1 1 1 1 1 1 1 1
symmnumber: 1
zpe: 1211538.7 jmol-1
zpe.correction: 0.461451 hartree
zpe.thermalcorrener: 0.493451 hartree
zpe.thermalcorrenthalpy: 0.494395 hartree
zpe.thermalcorrgfe: 0.395793 hartree
zpe.sumelectzpe: -1669.136368 hartree
zpe.sumelectthermal: -1669.104368 hartree
zpe.sumelectthermalent: -1669.103424 hartree
zpe.sumelectthermalfe: -1669.202026 hartree
dipole: -14.1232 -10.5164 1.6958
dipole: 17.6900
quadrupole: -198.1910 -230.9221 -200.1472
quadrupole: 45.9465 -11.2172 2.8884
quadrupole: 11.5624 -21.1687 9.6063 45.9465 -11.2172 2.8884
hfenergy: -1669.5978189 hartree
pointgroup: C01 [X(C25H24N6O5)]
dipole: 5.4996186 4.2544573 0.3036925 debye
polarizability: 688.6166533|-5.3574363|338.7265748|-22.4511052|-44.8665485|184.5208242 unknown
InChI: InChI=1S/C25H24N6O5/c1-11(33)12-2-4-16-13(6-12)7-14-8-15(3-5-17(14)16)27-25-28-21-22(29-24(26)30-23(21)35)31(25)20-9-18(34)19(10-32)36-20/h2-6,8,18-20,27,29,32,34H,7,9-10,26H2,1H3
charge 0 multiplicity 1
60 atoms
O  5.186705 1.501935 -0.882664
O  4.666283 4.071502 1.616659
O  7.444017 0.360046 0.330334
O  2.184644 -4.115755 0.5085
O  -9.836772 0.121329 0.587837
N  3.091487 0.339131 -0.645956
N  0.764476 1.053442 -0.923128
N  1.433932 -1.212104 -0.262692
N  5.05288 -1.206206 -0.280814
N  4.442142 -3.443747 0.427809
N  6.698727 -2.77208 0.310641
C  3.729548 1.644079 -0.969469
C  3.363166 2.773214 0.017854
C  4.455598 2.716479 1.109667
C  5.701123 2.164654 0.354693
C  6.531636 1.1574 1.170591
C  3.709228 -0.886481 -0.345748
C  1.686433 0.055618 -0.608746
C  2.695909 -1.816702 -0.085356
C  -2.714326 -0.073321 -0.108032
C  -3.661009 -1.141138 0.425554
C  -0.646544 1.001325 -0.769478
C  -3.458528 1.081667 -0.50132
C  -5.02798 -0.477325 0.305448
C  -4.884076 0.835718 -0.247575
C  -1.319843 -0.135628 -0.238505
C  3.031448 -3.204086 0.293587
C  -2.782781 2.201937 -1.038233
C  -1.38276 2.15758 -1.167896
C  5.347669 -2.512643 0.160354
C  -6.292785 -0.972432 0.647941
C  -6.024421 1.649381 -0.457312
C  -7.445886 -0.158556 0.440996
C  -7.291922 1.146861 -0.112475
C  -8.828317 -0.623947 0.785026
C  -9.010811 -2.018101 1.382392
H  3.502627 1.899461 -2.022051
H  2.352472 2.675954 0.441769
H  3.451975 3.752091 -0.48649
H  4.159099 2.023713 1.923917
H  6.321932 3.018439 0.0197
H  5.882852 0.405395 1.64806
H  7.093848 1.698748 1.959179
H  4.956281 4.048292 2.561681
H  1.11413 1.871671 -1.42217
H  -3.420092 -1.418287 1.470338
H  -3.596737 -2.075426 -0.165707
H  5.79056 -0.541883 -0.546309
H  -0.740355 -1.021984 0.032513
H  8.055629 0.954636 -0.172106
H  -3.330974 3.09731 -1.350638
H  -0.848323 3.024794 -1.579001
H  -6.394631 -1.977921 1.070831
H  -5.926516 2.655167 -0.880981
H  -8.199636 1.74216 -0.258182
H  7.384416 -2.016825 0.311413
H  6.95003 -3.710058 0.611023
H  -8.449274 -2.122235 2.329539
H  -8.641709 -2.798976 0.69131
H  -10.080795 -2.186384 1.57698
