program: Gaussian 09
title: 000178903
version: EM64L-G09RevD.01
frameworkgroup: C1[X(C17H10Cl2N2O4)]
method: RPBEPBE
basis: SDD
operation: Freq
keyword: #p
keyword: freq=noraman
keyword: PBEPBE/SDD
title: #p freq=noraman PBEPBE/SDD
converged: YES YES NO NO
title: Mulliken charges:
elementType: Cl Cl O O O O N N C C C C C C C C C C C C C C C C C H H H H H H H H H H
charge: 0.004363 0.007379 -0.423691 -0.399033 -0.212206 -0.222714 -0.337365 -0.019662 0.265143 -0.026496 0.296705 0.472411 -0.025407 -0.356316 -0.361255 -0.358549 -0.336857 0.096805 -0.227205 -0.236353 -0.054494 -0.186721 0.129784 -0.128297 -0.233083 0.255779 0.278025 0.312508 0.280895 0.263829 0.236747 0.235654 0.236921 0.385412 0.387346
chargesum: 0.00000
title: Mulliken charges with hydrogens summed into heavy atoms:
elementType: Cl Cl O O O O N N C C C C C C C C C C C C C C C C C
charge: 0.004363 0.007379 -0.038279 -0.011687 -0.212206 -0.222714 -0.337365 -0.019662 0.265143 -0.026496 0.296705 0.472411 -0.025407 -0.100536 -0.083231 -0.046042 -0.055962 0.096805 0.009542 -0.000700 -0.054494 0.077108 0.129784 -0.128297 0.003837
polarizability: 3.20928888e+02 8.68552162e+00 2.73093667e+02 1.73426826e+01 -2.03476581e+01 1.33354011e+02
1716.lowfreq: -5.3000 -0.0022 -0.0012 -0.0002 2.4453 3.4428 22.8257 24.3577 32.8800
frequency: 22.6982 24.3508 32.8789 42.8618 51.2644 60.0672 66.3047 94.9982 122.5135 133.9639 152.6649 162.6960 177.0847 181.3690 212.8668 226.0970 241.5721 268.5858 296.1629 328.6756 369.3669 383.4999 405.6125 417.2986 423.6680 446.6739 449.8223 494.8650 511.6714 547.2915 565.0522 582.8888 592.0753 614.0638 632.4784 643.1467 655.2207 663.1694 677.0762 688.2693 695.3380 703.7372 724.8329 745.9001 768.3403 790.6449 812.2859 822.1673 856.9239 888.4987 933.5200 945.9606 961.6322 981.6323 986.0475 989.8063 1002.7160 1003.0512 1029.2807 1035.2770 1075.6850 1089.5014 1119.7514 1126.4862 1148.6167 1157.9841 1176.6038 1196.6569 1239.1695 1252.2772 1271.3334 1321.7439 1330.8609 1344.0359 1369.3432 1374.4147 1391.3462 1413.7000 1434.9925 1458.9012 1472.7719 1482.1575 1535.9745 1576.0728 1583.4670 1595.8770 1613.8714 1644.9184 1666.1247 3131.4329 3138.8423 3151.6183 3166.2854 3168.2827 3181.4872 3187.5368 3189.7221 3507.3700 3514.3345
redmass: 8.9297 10.7105 8.7370 8.9856 5.7647 5.3765 8.5763 7.7920 7.1964 8.7899 6.6796 9.6038 9.5843 9.2797 7.6235 9.0633 7.8076 9.4287 6.3859 8.3815 6.8391 8.1382 2.8459 7.1030 6.1163 3.6604 7.2190 5.4048 5.3830 3.2278 3.3432 2.5751 1.6332 6.1297 4.4782 3.9544 2.9625 6.6792 6.2822 5.3806 3.8212 1.9451 7.0835 5.0064 2.7762 6.7259 1.4020 5.5448 1.2454 1.4656 1.4168 1.3485 8.3128 1.6630 4.6454 5.2203 3.8596 1.4794 2.8441 2.7382 2.6141 1.9662 2.5157 2.9526 1.7013 2.2244 1.0547 1.1277 1.7789 1.7172 2.5290 1.5463 4.7356 3.2492 7.3148 7.4872 4.1606 5.0952 2.3006 3.6382 3.4771 4.6294 7.6821 8.6299 5.9849 6.7383 6.0978 9.2622 9.2178 1.0855 1.0891 1.0942 1.0988 1.0894 1.0973 1.0942 1.0961 1.0638 1.0641
irintensity: 0.2764 2.2074 0.1332 0.1956 0.2499 0.3691 1.5314 0.4050 1.1012 0.3486 0.2737 1.4552 0.4313 0.9233 0.0135 1.8026 0.2793 2.7956 1.9294 0.5168 3.4100 4.7546 0.0342 0.6924 3.1543 5.7989 13.1210 23.9047 33.2864 11.8670 27.7928 63.9060 112.1875 3.7767 45.6501 48.9125 15.2810 15.4353 21.1024 28.3798 5.8109 39.8362 39.5109 66.9452 12.2955 17.1830 33.0369 41.3783 0.9161 25.5529 6.5011 0.4068 37.6016 59.8727 252.2437 2.3619 25.9352 6.1222 34.4092 131.6071 8.5180 5.4281 43.6852 147.6452 29.2814 21.5108 0.0385 1.9397 6.1256 1.4966 9.7799 8.1977 102.8575 41.8501 0.3623 5.9837 62.8517 38.9589 6.7717 146.5451 132.9008 6.0290 22.0022 12.5696 0.6961 23.8269 0.1641 146.9670 473.1567 0.9669 3.2366 23.3160 19.6712 0.8767 4.9260 1.7050 2.6467 38.8380 47.2978
temp: 298.150 k
press: 1.00000 atm
elementType: 17 17 8 8 8 8 7 7 6 6 6 6 6 6 6 6 6 6 6 6 6 6 6 6 6 1 1 1 1 1 1 1 1 1 1
symmnumber: 1
zpe: 616926.3 jmol-1
zpe.correction: 0.234975 hartree
zpe.thermalcorrener: 0.256883 hartree
zpe.thermalcorrenthalpy: 0.257827 hartree
zpe.thermalcorrgfe: 0.180694 hartree
zpe.sumelectzpe: -1982.589706 hartree
zpe.sumelectthermal: -1982.567798 hartree
zpe.sumelectthermalent: -1982.566854 hartree
zpe.sumelectthermalfe: -1982.643987 hartree
dipole: 0.4396 5.0151 -0.5651
dipole: 5.0659
quadrupole: -176.0216 -135.0227 -155.6090
quadrupole: -6.9201 3.7134 -2.5383
quadrupole: -20.4705 20.5284 -0.0579 -6.9201 3.7134 -2.5383
hfenergy: -1982.8246808 hartree
pointgroup: C01 [X(C17H10Cl2N2O4)]
dipole: 0.7126909 1.7680698 -0.5817475 debye
polarizability: 321.338237|-1.5112337|256.4973606|15.8210708|-50.1119877|149.5409687 unknown
InChI: InChI=1S/C17H10Cl2N2O4/c18-11-7-6-10(8-12(11)19)21-15(9-4-2-1-3-5-9)13(16(22)23)14(20-21)17(24)25/h1-8,22,24H
charge 0 multiplicity 1
35 atoms
Cl 4.106577 -3.345562 1.736396
Cl 5.963222 -1.429857 -0.190604
O  -3.506891 1.665317 -1.085349
O  -2.89456 -3.602299 0.932326
O  -4.376522 0.535121 0.747633
O  -4.305008 -2.331425 -0.414083
N  -0.054742 -0.745009 0.005231
N  -0.795345 -1.910469 0.194788
C  -0.863764 0.389742 -0.176488
C  -2.191371 -0.087713 -0.112397
C  -0.32745 1.770071 -0.22536
C  1.37642 -0.874584 -0.040217
C  -2.092115 -1.500441 0.129448
C  0.519376 2.23465 0.818953
C  -0.652554 2.643879 -1.295601
C  1.975033 -1.880586 0.752253
C  2.163466 -0.062961 -0.890188
C  -3.448479 0.691721 -0.074943
C  1.035991 3.546297 0.787385
C  -0.127277 3.954158 -1.326063
C  3.370057 -2.053208 0.709034
C  3.559922 -0.243056 -0.91801
C  -3.207931 -2.476178 0.170378
C  4.16823 -1.233258 -0.118843
C  0.718279 4.409226 -0.288182
H  0.75898 1.573993 1.659542
H  -1.317939 2.294347 -2.089222
H  1.350961 -2.52421 1.376175
H  1.703295 0.691481 -1.531282
H  4.181993 0.376483 -1.569632
H  1.680362 3.895413 1.601132
H  -0.380879 4.618958 -2.158739
H  1.122195 5.427218 -0.313356
H  -4.361998 2.167563 -0.988677
H  -3.661137 -4.236922 0.892263
