program: Gaussian 09
title: 000178955
version: EM64L-G09RevD.01
frameworkgroup: C1[X(C25H23FN6O5)]
method: RPBEPBE
basis: SDD
operation: Freq
keyword: #p
keyword: freq=noraman
keyword: PBEPBE/SDD
title: #p freq=noraman PBEPBE/SDD
converged: YES YES NO NO
title: Mulliken charges:
elementType: F O O O O O N N N N N N C C C C C C C C C C C C C C C C C C C C C C C C C H H H H H H H H H H H H H H H H H H H H H H H
charge: -0.207277 -0.289516 -0.418867 -0.478911 -0.217695 -0.230539 -0.207196 -0.283341 0.031641 -0.446555 -0.044923 -0.630215 -0.060465 -0.524258 -0.151013 -0.086620 -0.365009 -0.005054 0.343801 -0.144874 0.441651 0.307831 0.188513 -0.690930 -0.559122 0.198757 0.296152 -0.017109 -0.398421 0.182140 -0.410392 0.119410 -0.363516 -0.583814 -0.762945 -0.387674 0.344923 0.255232 0.248334 0.316083 0.257976 0.288037 0.226135 0.234469 0.352727 0.415480 0.260868 0.245046 0.294128 0.373558 0.287769 0.243341 0.246091 0.271158 0.286694 0.231408 0.259751 0.255514 0.313682 0.347951
chargesum: 0.00000
title: Mulliken charges with hydrogens summed into heavy atoms:
elementType: F O O O O O N N N N N N C C C C C C C C C C C C C C C C C C C C C C C C C
charge: -0.207277 -0.289516 -0.066140 -0.105353 -0.217695 -0.230539 -0.207196 -0.283341 0.031641 -0.031075 -0.044923 0.031418 0.194767 0.040159 0.106963 0.201418 0.095595 -0.005054 0.343801 -0.144874 0.441651 0.307831 0.188513 -0.185017 -0.264994 0.198757 0.296152 -0.017109 -0.110652 0.182140 -0.167051 0.119410 -0.117425 -0.312655 0.014908 -0.132161 0.344923
polarizability: 4.45649173e+02 3.57440982e+01 2.82472870e+02 -2.40044099e+00 2.14950088e+01 3.16574006e+02
1716.lowfreq: -3.7811 -0.0008 0.0003 0.0006 2.2947 4.8076 9.7312 17.7596 29.0580
frequency: 9.5547 17.7065 29.0282 32.2762 40.1044 45.0676 57.3167 71.3574 74.5783 95.3861 100.6897 112.8886 123.2782 131.0908 135.9757 141.0390 154.8132 165.1926 177.5631 194.9603 204.6971 207.3855 226.0095 241.1953 256.4732 270.0172 273.3964 285.1860 318.2712 319.9092 321.9456 336.0659 337.6608 357.6001 371.3099 378.4804 400.5573 403.9567 415.9035 424.7494 427.7377 440.4169 450.4433 488.1677 503.7744 511.0586 514.6503 524.4974 536.8833 538.9049 561.9161 567.7393 578.6936 587.1125 600.1937 615.7305 649.8138 656.7303 670.7384 684.5452 696.0799 702.1131 706.2282 713.4935 728.0272 748.5155 756.8130 760.3665 772.7509 784.7635 798.6446 817.7131 823.2760 833.1475 844.8571 854.0421 863.9873 897.8969 905.5656 916.7097 930.9828 937.1067 945.3160 946.5761 953.6423 958.1644 966.3493 976.0628 993.8326 1002.1934 1009.6038 1012.9673 1031.8046 1033.7424 1056.6246 1073.2921 1076.0618 1085.2805 1093.2164 1120.6727 1131.5972 1135.5339 1152.4194 1161.0112 1169.0058 1185.5157 1198.4810 1202.6121 1205.9606 1215.0909 1228.8614 1239.9106 1248.9778 1250.9868 1259.1779 1269.5790 1273.0862 1288.2779 1294.2907 1298.7500 1303.3076 1316.8465 1344.2927 1351.5262 1366.5919 1375.5409 1381.4820 1382.1376 1382.9999 1406.4196 1409.3618 1426.3894 1438.9604 1444.8114 1447.5010 1452.6233 1457.3382 1460.5424 1469.9462 1491.5807 1494.1647 1527.5530 1534.4246 1584.8259 1596.4189 1604.7394 1620.1576 1622.4404 1624.6805 1629.7351 1640.7300 2964.3186 2987.3975 2994.5891 3006.8000 3026.2169 3031.7367 3037.7696 3078.3072 3080.5267 3084.5752 3117.3962 3133.2035 3138.3547 3143.5004 3146.6494 3162.5288 3177.3742 3193.6497 3311.5340 3530.2719 3549.4218 3571.4499 3682.4099
redmass: 7.6386 6.1143 5.0951 4.8418 6.3231 6.1005 8.6721 5.8377 3.7988 6.2023 4.9132 6.0434 5.4730 5.3841 3.6635 1.0575 4.6494 7.4186 6.2091 4.3809 8.4258 6.1203 5.5944 2.2018 7.6952 4.6967 5.8322 1.7631 1.7645 3.3694 1.9765 3.1381 4.6384 5.6501 4.7384 5.5619 5.0594 1.2773 6.1203 2.8866 5.8483 3.2439 3.0190 4.9668 4.6485 3.7417 4.0831 4.1162 3.9047 4.9181 1.2433 5.1431 3.9576 5.2894 4.1676 3.7423 10.3254 5.6093 5.8471 7.6695 7.2889 6.2530 3.8819 6.0684 4.4634 4.5894 3.2635 2.8196 10.7112 2.2905 3.3156 1.5672 3.0733 1.7376 3.4127 3.3097 1.4523 3.0390 1.6389 3.8631 3.2466 2.6419 1.6843 1.8809 2.0524 5.0924 1.9324 2.4965 5.7967 2.3766 2.9940 2.0049 2.1462 2.5399 3.6231 2.6569 2.3100 3.3179 1.8865 1.8737 1.5183 1.1496 1.8548 2.5654 1.3353 1.2396 2.2139 1.2445 1.6911 3.2811 1.3460 4.9886 3.1608 1.7426 2.0446 1.8745 1.9207 1.9177 1.6490 1.5207 2.2449 2.2497 1.3628 2.5908 1.5178 6.0020 4.1013 1.2607 1.2109 3.7752 1.5221 1.1462 4.9136 4.1431 1.0861 1.1103 1.0621 2.5999 1.0871 3.9089 8.9386 3.6951 4.3658 7.3665 7.7433 1.3956 8.9097 7.9800 7.7912 7.4870 3.7967 1.0567 1.0611 1.0381 1.0868 1.1037 1.0992 1.0654 1.0884 1.0969 1.0884 1.1014 1.1001 1.0908 1.0900 1.0926 1.0933 1.0958 1.0942 1.0833 1.0452 1.0663 1.0664 1.1038
irintensity: 2.0462 0.2300 0.3450 1.5926 1.5004 9.3512 0.6674 6.2589 3.2901 0.8369 2.4507 2.1447 0.6719 2.4173 12.8864 0.5202 0.8375 3.0341 1.4230 4.8825 0.2605 1.3660 2.0879 8.0836 0.0595 6.8510 4.0142 52.6030 46.5570 46.8647 150.5606 79.9298 65.5796 8.9545 1.5948 7.3563 4.3505 55.0289 5.4001 10.7431 17.3669 1.0417 3.2625 1.4913 3.7153 11.7735 1.5023 2.3799 13.0996 2.0573 203.6885 0.4383 1.8985 20.1818 7.3737 0.6982 5.5430 1.8438 4.5683 6.5740 15.1309 21.7243 7.9191 2.0703 1.3962 5.4542 13.7787 53.0585 4.1630 21.0215 36.2536 67.0601 12.7381 8.3327 24.2432 20.4062 29.2420 39.2773 6.5688 25.7016 57.3291 5.3338 1.5316 2.3931 9.6147 43.9588 20.1791 16.5187 11.5582 58.3159 109.0791 31.1909 9.8411 34.0289 42.0153 25.8300 28.6642 12.1133 18.9678 23.2549 3.2961 0.2575 12.4098 24.2804 28.4338 25.8472 5.8071 20.4241 30.0562 5.5793 4.6150 178.9043 251.7220 57.9635 61.4469 55.9070 18.2373 28.8923 18.4465 4.5782 2.2163 69.5485 22.2949 69.6502 45.0629 6.6829 24.4710 32.4593 28.1719 219.1475 32.2642 14.8914 35.0498 59.4213 24.8862 26.1423 19.9063 172.3423 11.1561 4.4827 80.3100 239.3403 165.5150 16.3419 19.3943 100.1481 375.0027 78.3975 66.0952 279.7104 337.4683 29.5343 8.1395 6.4480 23.3927 31.8272 4.9688 5.3481 20.4694 10.4069 16.6563 6.1388 14.3027 8.6376 9.8430 0.1407 3.0402 7.1728 1.1159 522.1032 91.1638 13.4914 18.9030 44.2886
temp: 298.150 k
press: 1.00000 atm
elementType: 9 8 8 8 8 8 7 7 7 7 7 7 6 6 6 6 6 6 6 6 6 6 6 6 6 6 6 6 6 6 6 6 6 6 6 6 6 1 1 1 1 1 1 1 1 1 1 1 1 1 1 1 1 1 1 1 1 1 1 1
symmnumber: 1
zpe: 1188179.2 jmol-1
zpe.correction: 0.452554 hartree
zpe.thermalcorrener: 0.485158 hartree
zpe.thermalcorrenthalpy: 0.486102 hartree
zpe.thermalcorrgfe: 0.386589 hartree
zpe.sumelectzpe: -1768.307973 hartree
zpe.sumelectthermal: -1768.275369 hartree
zpe.sumelectthermalent: -1768.274425 hartree
zpe.sumelectthermalfe: -1768.373938 hartree
dipole: -3.6839 12.1655 -1.9018
dipole: 12.8525
quadrupole: -214.2925 -244.4121 -213.7242
quadrupole: -33.2075 8.6936 -16.0357
quadrupole: 9.8505 -20.2692 10.4187 -33.2075 8.6936 -16.0357
hfenergy: -1768.7605269 hartree
pointgroup: C01 [X(C25H23F1N6O5)]
dipole: 1.6184746 -4.2519271 -2.2069207 debye
polarizability: 442.9392141|38.0432497|301.1002079|16.84912|-26.3707381|300.6566272 unknown
InChI: InChI=1S/C25H23FN6O5/c1-11(34)31(15-3-5-17-13(8-15)6-12-7-14(26)2-4-16(12)17)25-28-21-22(29-24(27)30-23(21)36)32(25)20-9-18(35)19(10-33)37-20/h2-5,7-8,18-20,29,33,35H,6,9-10,27H2,1H3
charge 0 multiplicity 1
60 atoms
F  -7.965296 0.376402 -2.762415
O  3.378115 -2.14254 -0.110954
O  1.479138 -4.646827 0.087512
O  4.428862 -1.919828 -2.711394
O  3.261777 4.397677 -0.328543
O  -0.116397 -0.149302 4.396775
N  2.265194 -0.10271 0.507918
N  0.461412 0.284672 2.159281
N  1.753427 2.069527 1.047895
N  4.164057 0.397047 -1.064807
N  4.617635 2.766412 -1.350725
N  5.937513 1.14507 -2.423167
C  2.188264 -1.582175 0.560102
C  0.955342 -2.197353 -0.153924
C  1.508567 -3.487869 -0.807549
C  2.953344 -3.089059 -1.190097
C  3.052161 -2.437715 -2.573706
C  1.448922 0.787632 1.275691
C  3.135747 0.719382 -0.201833
C  2.809062 2.052942 0.124248
C  -0.87725 0.072867 1.628037
C  -2.604471 0.691891 0.034782
C  -3.440358 -0.35598 0.52706
C  -3.322465 1.457377 -1.070738
C  -1.331494 0.915578 0.578391
C  -4.709009 -0.33813 -0.223012
C  -4.656049 0.727648 -1.175815
C  3.533652 3.17934 -0.503088
C  -1.703745 -0.968918 2.127863
C  0.744489 0.233957 3.563023
C  -2.987443 -1.181009 1.579802
C  4.883767 1.489781 -1.583982
C  -5.856886 -1.1567 -0.125641
C  -5.739172 0.98211 -2.034086
C  2.142895 0.680515 3.967837
C  -6.953781 -0.913364 -0.98329
C  -6.864196 0.143406 -1.90967
H  2.231994 -1.868792 1.627683
H  0.574826 -1.49959 -0.91987
H  0.130172 -2.421902 0.537524
H  0.911157 -3.810677 -1.674712
H  3.64522 -3.945159 -1.128158
H  2.32065 -1.610603 -2.68469
H  2.849437 -3.207721 -3.344505
H  2.015255 -4.457735 0.900299
H  4.360694 -0.571241 -1.371756
H  -3.457618 2.524693 -0.807576
H  -2.762206 1.439587 -2.025834
H  -0.699797 1.74019 0.232227
H  4.556905 -1.55405 -3.622828
H  -1.352876 -1.58389 2.958123
H  -3.618128 -1.981805 1.981054
H  -5.909181 -1.971575 0.603924
H  -5.734798 1.790179 -2.771528
H  2.257889 1.766786 3.804861
H  2.935685 0.180125 3.382545
H  2.276017 0.45431 5.035684
H  -7.862719 -1.52031 -0.942741
H  6.369584 0.223843 -2.374693
H  6.480307 1.92898 -2.781115
