program: Gaussian 09
title: 000178898
version: EM64L-G09RevD.01
frameworkgroup: C1[X(C17H11ClN2O4)]
method: RPBEPBE
basis: SDD
operation: Freq
keyword: #p
keyword: freq=noraman
keyword: PBEPBE/SDD
title: #p freq=noraman PBEPBE/SDD
converged: YES YES NO NO
title: Mulliken charges:
elementType: Cl O O O O N N C C C C C C C C C C C C C C C C C H H H H H H H H H H H
charge: -0.042583 -0.424267 -0.400584 -0.213639 -0.224580 -0.334584 -0.021373 0.262724 -0.026152 0.299124 0.445587 -0.028277 -0.356256 -0.362736 -0.369236 -0.316708 0.096175 -0.227788 -0.236973 0.128983 -0.190630 -0.197692 -0.233662 -0.123313 0.255591 0.278297 0.288965 0.276099 0.235535 0.234615 0.262155 0.260948 0.235908 0.384440 0.385889
chargesum: 0.00000
title: Mulliken charges with hydrogens summed into heavy atoms:
elementType: Cl O O O O N N C C C C C C C C C C C C C C C C C
charge: -0.042583 -0.039827 -0.014696 -0.213639 -0.224580 -0.334584 -0.021373 0.262724 -0.026152 0.299124 0.445587 -0.028277 -0.100665 -0.084440 -0.080271 -0.040610 0.096175 0.007747 -0.002358 0.128983 0.071525 0.063256 0.002247 -0.123313
polarizability: 3.10980721e+02 1.20906387e+01 2.49028437e+02 1.38352423e+01 -2.34462566e+01 1.30699040e+02
1716.lowfreq: -5.9841 -0.6892 0.0017 0.0018 0.0020 3.1839 22.0377 32.5056 36.8215
frequency: 22.0067 32.5048 36.8098 45.3145 51.3584 65.7998 69.2684 98.1564 127.1462 134.2854 162.2903 171.5235 210.3365 224.6338 243.0740 266.5776 290.2165 321.8505 355.1727 376.4503 404.6419 411.1595 418.6443 435.2072 484.9190 487.3711 521.2783 545.9498 572.2175 589.7519 613.6599 618.5077 636.1737 644.4996 654.0306 674.7332 686.5061 701.8900 706.2157 710.6695 738.6940 760.4811 789.3023 800.0243 820.2139 832.0187 856.4118 932.7150 948.6814 953.7610 964.2736 980.6699 984.8855 989.7865 998.3134 1002.3849 1027.7467 1034.7867 1070.5001 1076.7217 1089.1521 1107.8956 1129.3001 1156.2798 1176.2225 1184.3904 1196.4308 1243.7722 1270.4273 1295.0797 1321.0182 1329.6316 1347.0898 1372.5102 1377.4414 1400.5700 1411.9850 1434.4648 1464.3684 1478.2958 1486.1235 1535.7194 1583.0165 1591.0867 1600.5734 1613.8397 1644.4653 1666.1599 3130.7922 3138.5234 3151.1087 3165.6345 3165.8421 3168.3744 3181.1062 3183.4870 3187.7121 3506.3804 3515.7319
redmass: 10.1694 9.0122 5.2086 5.6875 6.0944 4.9397 7.5509 7.2640 8.3647 8.5967 6.9926 8.6705 6.6436 10.1898 7.1490 8.3352 6.0721 6.4366 7.2703 5.8573 2.8476 3.1262 6.4239 8.4823 4.9750 4.5274 3.2178 3.9921 2.0094 1.5464 6.0440 5.0436 5.1928 4.2781 2.9072 5.9964 5.3530 2.2336 3.3087 6.3533 6.1137 2.6581 9.1513 3.7778 1.2768 1.5233 1.2447 1.4121 1.3779 5.5619 1.4392 1.7564 3.9721 5.4178 4.2208 1.3234 3.0453 2.6816 4.2370 2.1304 1.9615 1.6720 2.1662 2.9814 1.0546 1.1248 1.1273 2.4014 2.4956 1.2722 1.5358 4.5314 4.1607 6.8846 8.3202 3.8569 4.6749 2.2930 4.1065 3.0621 3.6918 7.6618 5.9284 8.1447 6.3030 6.0913 9.1824 9.1751 1.0853 1.0891 1.0942 1.0903 1.0975 1.0895 1.0971 1.0970 1.0978 1.0638 1.0640
irintensity: 2.0958 0.1977 0.4089 0.0898 0.5656 0.9524 1.0224 0.3370 0.9311 0.4184 1.3415 1.4565 0.0837 1.0429 0.2397 3.3160 1.0871 0.2703 3.9711 1.6408 0.0798 0.2466 4.1777 16.5922 7.9354 24.7138 55.5488 4.7221 40.1326 136.8900 5.1314 21.8809 41.1945 39.6746 18.0557 18.6485 45.0719 26.5048 22.7028 11.4704 59.5990 29.3380 11.8336 13.2993 6.8952 67.1213 1.1680 5.3472 7.3527 50.2030 6.8240 78.8872 224.1957 0.2165 41.6656 0.3528 32.5670 132.0207 16.6882 25.8262 6.9752 6.6983 155.1792 51.2767 0.0742 2.4680 1.9852 1.2382 7.6546 2.3886 7.9893 82.7075 48.7171 5.2888 2.0792 43.3407 51.3735 9.7426 33.8203 144.5681 71.3702 12.7351 0.3284 1.1469 0.7858 0.3101 145.2775 485.5677 0.7764 3.5765 24.1102 3.0128 18.8901 1.8313 5.0010 1.2504 0.0875 36.8561 46.0757
temp: 298.150 k
press: 1.00000 atm
elementType: 17 8 8 8 8 7 7 6 6 6 6 6 6 6 6 6 6 6 6 6 6 6 6 6 1 1 1 1 1 1 1 1 1 1 1
symmnumber: 1
zpe: 642318.0 jmol-1
zpe.correction: 0.244646 hartree
zpe.thermalcorrener: 0.265250 hartree
zpe.thermalcorrenthalpy: 0.266194 hartree
zpe.thermalcorrgfe: 0.192361 hartree
zpe.sumelectzpe: -1523.206290 hartree
zpe.sumelectthermal: -1523.185686 hartree
zpe.sumelectthermalent: -1523.184742 hartree
zpe.sumelectthermalfe: -1523.258576 hartree
dipole: 2.3491 3.4677 -0.0631
dipole: 4.1890
quadrupole: -163.1293 -121.4417 -142.4126
quadrupole: -2.5000 5.6196 -6.4396
quadrupole: -20.8015 20.8862 -0.0847 -2.5000 5.6196 -6.4396
hfenergy: -1523.4509363 hartree
pointgroup: C01 [X(C17H11Cl1N2O4)]
dipole: 1.1201041 1.1949663 -0.1831702 debye
polarizability: 312.1272364|6.0523869|235.3747346|16.3495869|-42.6642567|143.2062269 unknown
InChI: InChI=1S/C17H11ClN2O4/c18-11-6-8-12(9-7-11)20-15(10-4-2-1-3-5-10)13(16(21)22)14(19-20)17(23)24/h1-9,21,23H
charge 0 multiplicity 1
35 atoms
Cl 5.990266 -1.962873 0.363155
O  -3.125803 1.824636 -1.254173
O  -3.061754 -3.415078 0.925598
O  -4.190354 0.830557 0.554375
O  -4.287683 -2.06811 -0.522618
N  0.048793 -0.816112 0.113779
N  -0.793106 -1.912905 0.283304
C  -0.65294 0.3726 -0.146788
C  -2.017231 0.004838 -0.154166
C  -0.002618 1.703363 -0.191869
C  1.466983 -1.057186 0.166796
C  -2.047196 -1.403434 0.12802
C  0.824444 2.119062 0.888407
C  -0.198249 2.579038 -1.291611
C  1.944564 -2.057285 1.046685
C  2.359679 -0.352723 -0.674795
C  -3.205869 0.883243 -0.214336
C  1.447805 3.383499 0.863901
C  0.43314 3.841882 -1.314395
C  -3.238454 -2.284768 0.124789
C  3.32464 -2.338147 1.10621
C  3.7420 -0.626489 -0.612329
C  1.258014 4.248003 -0.240204
C  4.205794 -1.611966 0.280685
H  0.966849 1.457564 1.750055
H  -0.8471 2.268253 -2.114512
H  1.23382 -2.614417 1.662091
H  1.989911 0.395821 -1.379602
H  2.076516 3.694941 1.704817
H  0.278332 4.507901 -2.170074
H  3.704883 -3.107472 1.783667
H  4.441165 -0.087964 -1.257733
H  1.745049 5.229121 -0.259947
H  -3.941202 2.396458 -1.222639
H  -3.876088 -3.983851 0.852356
