program: Gaussian 09
title: 000178917
version: EM64L-G09RevD.01
frameworkgroup: C1[X(C20H13Br4ClN4O)]
method: RPBEPBE
basis: SDD
operation: Freq
keyword: #p
keyword: freq=noraman
keyword: PBEPBE/SDD
title: #p freq=noraman PBEPBE/SDD
converged: YES YES NO NO
title: Mulliken charges:
elementType: Br Br Br Br Cl O N N N N C C C C C C C C C C C C C C C C C C C C H H H H H H H H H H H H H
charge: 0.097652 0.122085 0.083490 0.059979 -0.028319 -0.157097 -0.188074 -0.033199 -0.393491 0.046180 0.075653 -0.629037 0.525220 0.073431 0.167118 0.018550 0.125903 -0.180924 -0.312920 -0.442509 -0.167156 0.383140 -0.318167 -0.251159 0.043345 -0.733762 -0.767306 -0.211503 -0.171743 -0.199087 0.271375 0.296906 0.260213 0.254025 0.259711 0.289616 0.225771 0.224107 0.240482 0.227376 0.210117 0.257165 0.346841
chargesum: 0.00000
title: Mulliken charges with hydrogens summed into heavy atoms:
elementType: Br Br Br Br Cl O N N N N C C C C C C C C C C C C C C C C C C C C
charge: 0.097652 0.122085 0.083490 0.059979 -0.028319 -0.157097 -0.188074 -0.033199 -0.046650 0.046180 0.075653 -0.060756 0.525220 0.073431 0.167118 0.018550 0.125903 0.079289 -0.058895 -0.442509 0.092555 0.383140 -0.028551 -0.251159 0.043345 -0.043402 -0.072648 -0.211503 -0.171743 -0.199087
polarizability: 4.93466276e+02 5.02375652e+00 3.19845735e+02 2.17224928e+01 -1.61090617e+01 2.57890648e+02
1716.lowfreq: -1.6223 -0.0019 -0.0017 -0.0015 3.6206 4.2019 14.1672 22.3504 28.1045
frequency: 14.1139 22.3486 28.0854 36.9127 47.5293 60.3128 83.2292 98.4934 101.9113 124.2657 128.2628 129.4125 137.9810 145.0958 149.4366 169.9235 175.2119 195.3358 196.3730 209.8022 211.9480 227.9663 232.9962 252.8089 269.3756 281.9553 291.8874 303.3847 310.4993 323.8292 331.7123 349.2936 376.0461 403.6469 420.6451 432.5705 451.1288 460.1419 466.0479 493.9373 500.1176 528.1065 541.6500 582.2679 584.5732 596.9009 606.0326 636.3318 655.1830 666.6188 675.9265 679.8053 696.1502 731.2729 749.6162 768.2698 774.0882 816.1139 824.2416 837.6637 871.0209 873.5609 886.7692 896.8688 914.9537 930.3663 937.6730 951.7886 969.3914 980.1632 995.1896 1009.6209 1022.0060 1050.1724 1073.1760 1093.4232 1118.3280 1130.7422 1148.5624 1162.9621 1180.8543 1181.5877 1193.9702 1213.5851 1225.2281 1228.2458 1277.7373 1295.0842 1304.8800 1308.9813 1326.0863 1334.3543 1339.4265 1366.7213 1382.0877 1402.6832 1405.2902 1436.4373 1441.6691 1464.6994 1470.4134 1487.8399 1493.9991 1498.6845 1510.8114 1534.6799 1593.6758 1628.7394 1665.3769 1738.9901 2973.7692 2988.2058 3046.1612 3065.9960 3083.5390 3089.9510 3093.2413 3099.2265 3124.7398 3125.5065 3127.6141 3185.8802 3589.6340
redmass: 22.1699 24.4107 14.8301 12.0633 15.9480 13.6144 8.4673 10.2767 9.9563 4.6617 7.2308 10.6384 36.6677 10.7510 11.4049 5.5808 4.1983 6.5069 7.1743 4.7607 34.5533 3.7424 1.2509 3.7887 3.3375 1.7849 2.3703 5.1904 3.6460 4.6417 5.8852 6.6982 3.4348 7.3007 5.4270 5.8560 5.7405 6.8665 4.9163 5.0381 4.6230 4.1387 4.9586 6.2396 5.3592 4.9827 5.6843 9.4368 10.9208 5.2921 1.1875 5.2002 5.9762 7.5466 6.5927 5.5381 7.1123 4.8651 2.8644 2.7844 1.9034 2.1716 1.4831 6.2843 4.9020 9.0696 1.5156 4.5171 2.1157 1.2196 2.5343 1.3691 5.6372 4.3475 4.1420 1.8286 1.9433 2.2161 2.3391 4.7827 2.3104 2.5690 2.3786 3.2890 5.0777 3.5925 4.3827 2.4373 3.5235 1.3352 6.4345 4.1984 1.5752 8.2083 1.1943 1.2091 5.3469 1.4580 2.0753 1.0586 1.1086 1.4691 1.2585 1.5461 10.5307 11.1202 9.0720 6.4083 8.9790 12.3490 1.0368 1.0359 1.0610 1.1000 1.1000 1.0979 1.0914 1.0999 1.0895 1.0902 1.1039 1.0934 1.0812
irintensity: 0.0663 0.5135 0.3796 0.0206 0.1455 2.3382 1.4591 0.2814 1.0021 1.4120 1.2724 0.3559 0.1290 1.1431 0.6601 0.3385 0.8413 0.8909 0.5396 2.1469 0.2607 3.2418 0.4213 1.4337 0.3792 0.3180 1.9191 1.0351 3.7180 7.9344 4.3738 4.5766 1.0393 1.0838 3.8633 10.6485 3.7844 8.8658 4.0753 5.8481 8.3881 8.4541 3.1851 7.7852 10.6878 25.6684 12.2714 4.2364 0.5136 18.6317 67.4511 5.7317 18.7714 3.4136 1.9396 10.1835 5.5214 27.3756 11.2797 11.1315 18.0567 20.1958 24.5052 75.2028 8.8689 35.7829 2.0711 0.5955 5.3082 31.4724 6.8775 2.3105 51.4247 16.9148 5.0100 7.6654 63.2726 6.0643 16.3436 2.7280 23.0973 12.4451 14.3666 36.2043 199.5200 27.1212 17.2491 64.0616 84.2814 17.6291 80.2541 26.8985 91.3276 17.9760 14.2093 10.1629 37.4091 143.5013 125.8934 4.0942 1.5113 4.1789 23.7244 20.3228 201.2157 24.3637 65.1354 62.2030 26.6428 377.5641 32.1837 30.0534 5.5417 27.2233 22.9895 24.6821 5.3205 10.9462 10.7312 5.5194 4.5723 0.2989 54.7031
temp: 298.150 k
press: 1.00000 atm
elementType: 35 35 35 35 17 8 7 7 7 7 6 6 6 6 6 6 6 6 6 6 6 6 6 6 6 6 6 6 6 6 1 1 1 1 1 1 1 1 1 1 1 1 1
symmnumber: 1
zpe: 748502.3 jmol-1
zpe.correction: 0.285089 hartree
zpe.thermalcorrener: 0.313478 hartree
zpe.thermalcorrenthalpy: 0.314422 hartree
zpe.thermalcorrgfe: 0.222699 hartree
zpe.sumelectzpe: -1575.858570 hartree
zpe.sumelectthermal: -1575.830181 hartree
zpe.sumelectthermalent: -1575.829237 hartree
zpe.sumelectthermalfe: -1575.920960 hartree
dipole: 2.9009 -4.6721 5.9655
dipole: 8.1136
quadrupole: -201.8805 -227.3880 -216.5422
quadrupole: -21.1890 21.8107 6.2685
quadrupole: 13.3897 -12.1178 -1.2719 -21.1890 21.8107 6.2685
hfenergy: -1576.143659 hartree
pointgroup: C01 [X(C20H13Br4Cl1N4O1)]
dipole: 1.1033708 -2.5775258 1.5259963 debye
polarizability: 493.2528123|-5.4907335|322.7237764|22.702781|8.6778779|255.2260704 unknown
InChI: InChI=1S/C20H13Br4ClN4O/c1-19(2)4-3-11-20(13-10(26-11)5-8(21)14(22)15(13)23)6-12(30)29(20)7-9(25)16-17(19)28-18(24)27-16/h3-5,7,28H,6H2,1-2H3
charge 0 multiplicity 1
43 atoms
Br -3.622836 2.569035 -0.930245
Br -6.130332 0.548815 -2.067044
Br -6.053301 -2.792015 -1.291559
Br 5.916312 -1.003632 -3.411991
Cl 2.627127 2.708695 0.577637
O  -0.323272 3.925954 0.941911
N  -0.388119 1.593586 0.187498
N  -1.39848 -1.701599 1.212972
N  4.505887 -1.338509 -0.903515
N  3.788651 0.464937 -2.062457
C  -1.37339 0.698174 0.933024
C  -1.635185 1.91863 1.897983
C  -2.583877 0.107024 0.219926
C  -0.700935 -0.599024 1.465198
C  -0.678459 2.742308 0.996584
C  -2.570915 -1.294518 0.491792
C  3.118076 -1.33306 1.277323
C  0.684903 1.060749 -0.554503
C  0.708069 -0.576692 1.874387
C  -3.633291 0.659313 -0.526122
C  1.592317 -1.445407 1.300811
C  3.49198 -0.776319 -0.111779
C  -3.595111 -2.143715 0.054204
C  2.019592 1.296979 -0.433229
C  3.052772 0.345285 -0.861911
C  3.67934 -0.40327 2.3893
C  3.702491 -2.764567 1.470185
C  -4.684156 -0.187232 -1.002667
C  -4.650559 -1.57547 -0.69439
C  4.634942 -0.560568 -2.048325
H  -1.233784 1.773004 2.914536
H  -2.67215 2.279747 1.949149
H  0.400844 0.200994 -1.17337
H  1.063421 0.296678 2.435002
H  1.177308 -2.24857 0.672907
H  -3.571397 -3.210874 0.283877
H  3.382542 -0.782713 3.38396
H  4.782401 -0.376142 2.342322
H  3.321317 0.633837 2.281908
H  3.354675 -3.46279 0.686261
H  4.80929 -2.75259 1.481108
H  3.374586 -3.16615 2.44409
H  5.046108 -2.17382 -0.681549
