program: Gaussian 09
title: 000178904
version: EM64L-G09RevD.01
frameworkgroup: C1[X(C18H10F3N3O6)]
method: RPBEPBE
basis: SDD
operation: Freq
keyword: #p
keyword: freq=noraman
keyword: PBEPBE/SDD
title: #p freq=noraman PBEPBE/SDD
converged: YES YES NO NO
title: Mulliken charges:
elementType: F F F O O O O O O N N N C C C C C C C C C C C C C C C C C C H H H H H H H H H H
charge: -0.159057 -0.163007 -0.159814 -0.427272 -0.398570 -0.204458 -0.217637 -0.197845 -0.198489 -0.342255 -0.014219 0.027830 0.269853 -0.024757 0.468614 0.312191 -0.025645 -0.453367 -0.380531 0.323068 -0.326116 -0.330747 -0.190560 -0.360831 0.098563 -0.358013 -0.370603 0.382058 0.131143 0.252679 0.298512 0.293818 0.267131 0.291153 0.248216 0.272482 0.292882 0.292422 0.390869 0.390308
chargesum: 0.00000
title: Mulliken charges with hydrogens summed into heavy atoms:
elementType: F F F O O O O O O N N N C C C C C C C C C C C C C C C C C C
charge: -0.159057 -0.163007 -0.159814 -0.036403 -0.008263 -0.204458 -0.217637 -0.197845 -0.198489 -0.342255 -0.014219 0.027830 0.269853 -0.024757 0.468614 0.312191 -0.025645 -0.154854 -0.086713 0.323068 -0.058985 -0.039594 0.057656 -0.088349 0.098563 -0.065131 -0.078180 0.382058 0.131143 0.252679
polarizability: 3.34482253e+02 -2.06648094e+01 2.67913401e+02 9.72379260e+00 4.28888195e+01 1.64693423e+02
1716.lowfreq: -5.1708 -4.0709 -1.6683 -0.0004 0.0002 0.0005 10.2634 17.8106 19.5554
frequency: 10.0959 17.7940 19.5093 27.8404 32.5765 39.5171 52.6911 61.3829 67.8889 87.8034 119.1068 128.2002 131.1106 139.9021 146.0655 182.9102 206.4791 215.1055 237.3432 242.6053 283.0591 303.6881 313.3363 328.6436 342.7727 358.9428 378.5170 400.9583 410.4279 429.9775 448.8225 472.7717 481.5958 506.5284 511.9104 523.8903 538.0149 568.1375 593.0354 606.7941 611.0790 624.4810 640.0198 645.2168 654.0687 661.0429 669.6558 690.2667 694.0497 698.1659 719.0574 735.1740 759.8784 785.5862 789.5727 813.0847 814.5240 852.0894 870.7874 911.9277 933.8226 959.0768 985.1426 987.3219 988.7372 990.2499 994.9483 996.1986 1008.8554 1014.8855 1031.2120 1047.3998 1090.2237 1094.1825 1106.8582 1114.6834 1126.7253 1155.7834 1187.7316 1188.8213 1219.6053 1239.7722 1267.3013 1277.0270 1303.5114 1313.1383 1330.7371 1346.7125 1365.1745 1389.8096 1393.9310 1407.0876 1415.8038 1444.1626 1470.1897 1478.3953 1487.5580 1537.8385 1589.7277 1600.5992 1610.2286 1621.8329 1646.2893 1667.0128 3152.7703 3157.0021 3174.9910 3177.2099 3181.3939 3187.4627 3187.6272 3195.5195 3505.0816 3514.5475
redmass: 17.5656 10.9328 10.5905 9.0933 8.3330 8.5420 7.4793 8.3418 7.4393 6.8404 10.1421 7.4549 8.9589 9.6263 7.9477 7.1008 8.8468 7.8793 7.5505 10.9231 5.9287 7.1353 6.8189 8.1074 10.1172 7.1197 8.1141 7.5395 2.9075 5.3789 8.0940 4.7369 5.8835 6.3770 9.1719 5.8590 5.5637 1.8735 1.5588 7.9664 7.0550 6.6072 3.9225 4.9165 3.9230 3.6823 4.2781 7.7472 2.3717 6.2035 8.2721 5.6524 7.3385 9.2700 10.1072 1.7429 4.0839 1.2437 1.7170 1.4477 1.4123 8.5340 6.3950 4.0579 5.1392 1.7392 1.4152 1.4215 3.1658 5.2699 4.7132 4.7814 3.1712 2.2188 2.0233 1.4506 2.4923 3.1357 1.4370 1.1071 4.4143 2.4656 2.4984 2.9675 1.3178 1.4083 4.2222 5.4994 7.3887 11.1439 9.8067 5.0948 3.7680 3.7300 4.0338 4.2960 3.0800 8.1806 7.9308 6.7479 6.3036 6.2803 9.3837 9.3235 1.0908 1.0882 1.0938 1.0895 1.0929 1.0952 1.0987 1.0971 1.0639 1.0641
irintensity: 0.0349 0.0958 2.8550 0.0983 0.8034 0.3109 0.6183 1.3435 1.2325 2.5693 0.6819 0.7911 3.3829 0.8620 2.0695 0.8816 1.8999 0.4856 0.3751 0.7922 0.4040 3.1425 1.2485 1.9289 6.6691 4.3278 4.5767 2.5316 0.4354 1.0807 5.3027 1.3569 5.4011 2.0736 1.6369 19.0876 5.5740 54.9955 139.7105 7.6634 40.4095 7.5449 60.5984 34.5622 13.1167 25.9170 38.6114 1.6078 20.4883 23.1375 15.8278 20.9044 42.8159 14.7663 19.0105 33.6541 52.7303 1.0130 75.0709 47.1641 2.3268 70.8771 230.6311 139.2603 7.1726 43.6526 16.2805 4.6970 13.5299 141.1032 227.4100 52.1692 32.9839 1.7650 1.5681 11.3007 125.9657 83.2688 73.5082 3.2300 277.6633 32.3959 125.1528 48.1927 7.5293 15.7637 104.5855 120.8589 70.4958 26.4677 5.5122 29.0593 63.2153 86.0471 26.0801 39.9120 31.9679 16.7495 0.6706 15.8899 40.7483 13.9297 145.3936 426.6519 3.7870 5.3355 2.2763 1.2367 0.5913 2.6941 1.2676 1.5236 44.1508 53.9921
temp: 298.150 k
press: 1.00000 atm
elementType: 9 9 9 8 8 8 8 8 8 7 7 7 6 6 6 6 6 6 6 6 6 6 6 6 6 6 6 6 6 6 1 1 1 1 1 1 1 1 1 1
symmnumber: 1
zpe: 678685.7 jmol-1
zpe.correction: 0.258498 hartree
zpe.thermalcorrener: 0.284486 hartree
zpe.thermalcorrenthalpy: 0.285431 hartree
zpe.thermalcorrgfe: 0.197008 hartree
zpe.sumelectzpe: -1604.861076 hartree
zpe.sumelectthermal: -1604.835087 hartree
zpe.sumelectthermalent: -1604.834143 hartree
zpe.sumelectthermalfe: -1604.922566 hartree
dipole: 2.6097 -3.8220 -1.4390
dipole: 4.8466
quadrupole: -206.6402 -165.1045 -167.0801
quadrupole: 8.7072 1.6725 16.0134
quadrupole: -27.0319 14.5038 12.5282 8.7072 1.6725 16.0134
hfenergy: -1605.1195737 hartree
pointgroup: C01 [X(C18H10F3N3O6)]
dipole: -1.1482411 1.4097781 -0.5743582 debye
polarizability: 336.398013|-17.6651688|262.4131445|-11.9267196|-46.1064897|168.277919 unknown
InChI: InChI=1S/C18H10F3N3O6/c19-18(20,21)10-2-1-3-12(8-10)23-15(9-4-6-11(7-5-9)24(29)30)13(16(25)26)14(22-23)17(27)28/h1-8,25,27H
charge 0 multiplicity 1
40 atoms
F  3.926764 3.852521 0.924228
F  3.188031 1.971167 1.964004
F  4.167281 1.833592 -0.073633
O  -2.430042 -2.922429 1.440184
O  -5.456037 1.527037 -0.355758
O  -4.142915 -2.640931 -0.104601
O  -5.546827 -0.216586 1.184767
O  4.21312 -3.347086 -1.587779
O  3.929107 -4.21792 0.502301
N  -1.362463 0.983844 -0.153187
N  -2.667474 1.469071 -0.125909
N  3.56556 -3.461333 -0.477621
C  -1.290903 -0.392188 0.120692
C  -2.62486 -0.799213 0.343181
C  -0.308797 1.937608 -0.37722
C  -0.044801 -1.180859 -0.018281
C  -3.428632 0.378517 0.166083
C  0.928777 1.816206 0.289004
C  -0.562191 3.02838 -1.242535
C  1.930184 2.781359 0.048978
C  0.714421 -1.093558 -1.219919
C  0.399717 -2.034383 1.026542
C  0.445149 3.990594 -1.456619
C  1.700905 3.86984 -0.823098
C  -3.159749 -2.171028 0.505556
C  1.89652 -1.837711 -1.3779
C  1.584926 -2.780598 0.882908
C  2.31596 -2.670813 -0.318319
C  -4.889635 0.500334 0.398361
C  3.272002 2.619408 0.708472
H  1.108792 1.005919 0.999255
H  -1.54331 3.116458 -1.716092
H  0.367112 -0.454437 -2.037953
H  -0.189241 -2.111107 1.942986
H  0.251123 4.83716 -2.121847
H  2.483446 4.615774 -0.989302
H  2.490428 -1.788906 -2.293859
H  1.948603 -3.437626 1.676885
H  -2.827079 -3.834713 1.495445
H  -6.425272 1.589937 -0.134903
