program: Gaussian 09
title: 000178865
version: EM64L-G09RevD.01
frameworkgroup: C1[X(C19H15ClN2O4)]
method: RPBEPBE
basis: SDD
operation: Freq
keyword: #p
keyword: freq=noraman
keyword: PBEPBE/SDD
title: #p freq=noraman PBEPBE/SDD
converged: YES YES NO NO
title: Mulliken charges:
elementType: Cl O O O O N N C C C C C C C C C C C C C C C C C C C H H H H H H H H H H H H H H H
charge: -0.014113 -0.268645 -0.249200 -0.212268 -0.241430 -0.356808 -0.020451 0.291636 0.002909 0.313584 -0.080111 0.606547 -0.379966 -0.364133 0.144290 -0.319027 -0.356605 0.194986 -0.235161 -0.242312 -0.215259 -0.218892 -0.236805 -0.224950 -0.503035 -0.500749 0.282182 0.250379 0.272975 0.229932 0.230074 0.259419 0.240042 0.231765 0.239524 0.241201 0.229530 0.256928 0.244838 0.241379 0.235801
chargesum: 0.00000
title: Mulliken charges with hydrogens summed into heavy atoms:
elementType: Cl O O O O N N C C C C C C C C C C C C C C C C C C C
charge: -0.014113 -0.268645 -0.249200 -0.212268 -0.241430 -0.356808 -0.020451 0.291636 0.002909 0.313584 -0.080111 0.606547 -0.097784 -0.113755 0.144290 -0.319027 -0.083630 0.194986 -0.005229 -0.012238 0.044160 0.021150 -0.005040 0.014574 0.224625 0.221269
polarizability: 2.99876265e+02 2.74327859e+00 2.66069386e+02 -1.60190172e+01 3.14884260e+01 1.70938909e+02
1716.lowfreq: -7.6966 -0.0014 -0.0013 -0.0009 1.1888 4.5720 7.4795 27.3884 30.2818
frequency: 7.3380 27.3845 30.2180 47.5888 50.4431 53.8245 65.0866 76.2536 90.7747 102.5113 116.1049 118.6519 125.8301 135.0462 164.2243 191.8871 200.7528 222.5585 239.8825 250.6790 262.0955 268.0131 292.2653 325.6591 356.5255 392.2435 405.7584 409.1454 450.7006 455.2639 473.6070 505.2245 532.7090 549.5796 605.5582 615.1861 641.2400 647.8250 670.9643 695.5165 701.6516 709.6670 723.7341 739.3757 745.6373 761.4109 769.4393 787.2365 803.5025 854.9540 866.2829 895.5839 919.5515 934.1318 951.6364 958.0186 982.7150 988.2895 989.4899 1000.6343 1019.8110 1025.4927 1029.3463 1039.1884 1082.8731 1089.6758 1111.7739 1112.5855 1119.6322 1135.7128 1148.7184 1149.7867 1152.1945 1172.9233 1175.6245 1198.8940 1216.1318 1258.2559 1296.9854 1324.7725 1344.3376 1371.9434 1375.2115 1399.7574 1413.6804 1421.7608 1429.8556 1438.1678 1451.7671 1452.1098 1457.7579 1462.4755 1462.8041 1481.5090 1483.0454 1544.0679 1580.5152 1585.4095 1602.2279 1616.4955 1619.9786 1646.4938 3003.5647 3006.5958 3104.7965 3111.1095 3128.2831 3138.0090 3144.2223 3149.5977 3150.7124 3151.2452 3158.0093 3163.7019 3170.8815 3175.1946 3180.4282
redmass: 5.8418 7.5488 5.5496 5.3479 5.4933 4.9939 4.7697 4.0974 1.8115 1.7882 1.4751 3.0336 4.0386 4.9619 5.3552 5.6668 7.3560 5.5582 6.3344 7.1485 6.1236 5.4937 4.3752 5.0429 7.2122 7.9353 3.0028 5.9320 9.0292 3.8125 5.3053 6.0466 5.2760 6.3522 6.1480 6.5207 10.3861 6.7725 6.6595 6.9671 1.8947 5.8614 5.2451 3.5035 5.7111 2.7839 1.5909 3.7117 6.7192 1.2473 1.3921 8.6007 5.7570 1.5455 1.4828 6.1731 1.3913 1.3607 5.6065 1.3305 6.7943 4.8430 3.0989 2.5381 2.2490 2.3231 1.2716 1.2645 2.6174 2.3637 1.5504 1.5745 3.5700 1.0568 1.0545 1.1278 7.2337 1.4690 5.8962 1.5602 3.5201 10.2496 6.5123 3.1213 1.3508 1.3358 2.3185 2.3574 1.0577 1.0501 2.7784 1.1271 1.0717 2.9850 3.5225 7.7967 6.7549 6.0793 7.1269 6.1171 10.4995 10.9528 1.0297 1.0291 1.1045 1.1047 1.0849 1.0887 1.0862 1.1050 1.0941 1.1046 1.0908 1.0980 1.0953 1.0983 1.1007
irintensity: 2.7924 0.7592 0.1177 1.9124 0.8703 0.8388 0.6224 0.3042 0.0955 1.5717 0.4142 1.3404 0.1230 0.5219 0.9387 2.3794 1.7279 5.4535 2.2281 1.4016 1.4310 2.3348 27.1970 10.0164 5.9436 2.0319 0.2372 3.0761 4.3040 4.2370 2.6629 5.1829 1.9722 11.9072 7.4609 0.3029 5.4160 6.3023 0.4496 0.9407 49.5617 3.9789 7.6542 28.8717 50.4369 2.7770 67.0815 26.7164 8.9485 1.4056 1.1892 14.3994 16.7662 2.3891 6.1839 14.9567 2.1143 0.0130 0.4098 1.2313 53.6549 140.6542 20.7700 81.2141 41.8333 51.5118 1.6351 0.3993 38.4782 43.2642 22.1351 8.9462 167.8651 0.3514 0.0961 2.3789 226.4795 3.4156 79.3277 12.8840 42.5608 5.8686 2.9272 50.3218 11.3162 39.4979 16.4847 4.1167 11.3079 13.0152 57.2847 11.0486 20.3836 94.1089 22.3372 18.2367 7.7652 0.8281 10.2330 6.3899 152.2487 238.1219 42.2431 33.1847 24.6481 19.6549 0.4552 6.5729 1.7478 10.8586 31.5782 15.0079 10.6843 17.6432 3.6663 9.8698 10.6118
temp: 298.150 k
press: 1.00000 atm
elementType: 17 8 8 8 8 7 7 6 6 6 6 6 6 6 6 6 6 6 6 6 6 6 6 6 6 6 1 1 1 1 1 1 1 1 1 1 1 1 1 1 1
symmnumber: 1
zpe: 785905.7 jmol-1
zpe.correction: 0.299336 hartree
zpe.thermalcorrener: 0.323614 hartree
zpe.thermalcorrenthalpy: 0.324558 hartree
zpe.thermalcorrgfe: 0.241317 hartree
zpe.sumelectzpe: -1601.625597 hartree
zpe.sumelectthermal: -1601.601319 hartree
zpe.sumelectthermalent: -1601.600374 hartree
zpe.sumelectthermalfe: -1601.683615 hartree
dipole: 4.4494 -0.0314 -0.4642
dipole: 4.4737
quadrupole: -137.7916 -131.9341 -156.2407
quadrupole: -0.7208 -9.3049 9.4484
quadrupole: 4.1972 10.0547 -14.2519 -0.7208 -9.3049 9.4484
hfenergy: -1601.9249324 hartree
pointgroup: C01 [X(C19H15Cl1N2O4)]
dipole: 1.7396579 -0.1809603 -0.1967307 debye
polarizability: 300.2169258|0.2855809|255.8793574|-11.7171289|44.0824209|180.7882777 unknown
InChI: InChI=1S/C19H15ClN2O4/c1-25-18(23)15-16(19(24)26-2)21-22(14-11-7-6-10-13(14)20)17(15)12-8-4-3-5-9-12/h3-11H,1-2H3
charge 0 multiplicity 1
41 atoms
Cl 2.143386 -0.730922 2.343519
O  -1.966512 2.58288 1.189863
O  -3.562839 -2.355701 -0.500797
O  -2.872819 2.215616 -0.92418
O  -4.18255 -0.334855 0.48883
N  0.294452 -0.928991 -0.182172
N  -0.883251 -1.67152 -0.209076
C  0.072537 0.45305 -0.048747
C  -1.326718 0.594472 0.028836
C  1.151648 1.459914 -0.119857
C  -1.866602 -0.730223 -0.087135
C  1.537334 -1.646502 -0.249185
C  1.180866 2.551774 0.788847
C  2.166092 1.360425 -1.111511
C  -2.129258 1.847996 0.011674
C  2.481395 -1.631461 0.804924
C  1.793718 -2.445195 -1.389077
C  -3.300664 -1.08804 0.006588
C  2.20625 3.517188 0.707882
C  3.190478 2.326806 -1.18681
C  3.687251 -2.353039 0.705874
C  2.98975 -3.183886 -1.49045
C  3.216401 3.408156 -0.275929
C  3.943236 -3.126962 -0.447436
C  -2.790477 3.815497 1.276737
C  -4.977794 -2.788051 -0.405413
H  0.403794 2.627764 1.554568
H  2.14251 0.54153 -1.838142
H  1.036009 -2.478232 -2.17771
H  2.220863 4.350955 1.418399
H  3.961957 2.240189 -1.959636
H  4.404252 -2.321511 1.531132
H  3.176157 -3.798512 -2.376568
H  4.01302 4.15813 -0.334014
H  4.878383 -3.691622 -0.519833
H  -2.50006 4.526657 0.485258
H  -2.581734 4.221988 2.276164
H  -3.856455 3.558476 1.163559
H  -5.628925 -2.087322 -0.954654
H  -5.295763 -2.825663 0.650296
H  -4.99272 -3.787654 -0.860919
