program: Gaussian 09
title: 000178879
version: EM64L-G09RevD.01
frameworkgroup: C1[X(C21H18Cl2N2O4)]
method: RPBEPBE
basis: SDD
operation: Freq
keyword: #p
keyword: freq=noraman
keyword: PBEPBE/SDD
title: #p freq=noraman PBEPBE/SDD
converged: YES YES NO NO
title: Mulliken charges:
elementType: Cl Cl O O O O N N C C C C C C C C C C C C C C C C C C C C C H H H H H H H H H H H H H H H H H H
charge: -0.036163 -0.040357 -0.272282 -0.248239 -0.220645 -0.234394 -0.341360 -0.020414 0.262821 -0.055400 0.290588 -0.078381 0.478742 0.164896 -0.359980 -0.364686 -0.306413 -0.366648 0.196959 -0.227259 -0.238381 -0.057713 -0.068820 -0.234083 -0.256715 -0.214484 -0.217467 -0.680033 -0.671175 0.255667 0.272905 0.302588 0.313294 0.235019 0.233470 0.235346 0.286169 0.229730 0.240273 0.229186 0.233973 0.215933 0.225028 0.233033 0.232405 0.233374 0.210090
chargesum: 0.00000
title: Mulliken charges with hydrogens summed into heavy atoms:
elementType: Cl Cl O O O O N N C C C C C C C C C C C C C C C C C C C C C
charge: -0.036163 -0.040357 -0.272282 -0.248239 -0.220645 -0.234394 -0.341360 -0.020414 0.262821 -0.055400 0.290588 -0.078381 0.478742 0.164896 -0.104313 -0.091781 -0.003826 -0.053353 0.196959 0.007760 -0.004911 -0.057713 -0.068820 0.001263 0.029454 0.255519 0.245692 -0.006038 0.004695
polarizability: 3.45816693e+02 6.35049166e+00 3.51782825e+02 -1.42239905e+01 2.03570028e+01 1.69485770e+02
1716.lowfreq: -4.2784 -0.0019 -0.0003 0.0005 0.9883 2.6720 15.3786 17.0251 23.4066
frequency: 15.3161 16.9945 23.4012 33.6117 40.0182 47.1151 50.7382 58.2717 68.0533 77.4265 97.6308 103.3592 111.8358 117.3441 150.1716 153.0811 169.3947 181.7964 196.0199 206.0958 207.6046 241.2016 243.5697 250.0460 253.9483 256.4663 267.4138 309.8107 353.4681 372.6486 374.9041 382.1276 399.3258 405.8775 411.9456 439.1281 480.9842 498.9656 514.5831 547.4250 563.7206 613.4729 622.7942 642.3188 663.1395 679.7402 697.4315 703.1424 734.0319 757.3915 758.5616 770.3761 778.1794 784.0447 800.3763 801.0737 818.8996 829.4194 855.6115 858.6339 861.6350 875.2117 888.9675 931.7307 965.0243 980.4604 981.7399 989.6988 1001.9041 1008.7335 1020.8234 1027.4231 1034.8613 1078.1291 1084.7793 1095.2437 1104.9355 1112.2748 1113.6108 1128.5478 1135.3263 1135.6053 1147.2896 1175.9336 1195.3483 1211.3048 1249.4264 1250.8252 1255.5881 1294.3471 1318.8003 1337.2422 1351.1607 1356.8338 1372.4877 1379.0059 1398.6542 1399.9207 1404.6699 1422.1431 1433.4595 1445.8545 1463.0809 1465.1499 1465.5756 1472.4966 1474.0556 1477.6507 1486.4875 1487.4246 1538.6020 1573.1407 1583.3874 1597.7431 1613.8660 1617.5135 1637.3210 2994.0231 2997.4756 3010.5006 3014.2482 3070.1036 3072.4168 3090.6861 3093.9401 3105.9559 3109.9707 3130.4569 3137.7296 3150.5083 3165.1054 3178.0952 3189.0405 3194.4071 3196.1056
redmass: 5.0774 9.9081 5.7023 4.4066 6.5787 6.3035 5.3356 2.7974 2.5773 2.9725 6.5853 7.5289 3.0533 4.4711 13.2847 6.3206 3.6074 4.8195 5.9369 3.8893 3.4463 4.9368 4.2213 4.5428 1.6241 2.3022 2.7992 7.7964 3.8612 4.4798 6.5545 7.8520 6.4501 2.8584 9.0405 7.2332 4.7872 6.5247 5.2842 6.7739 5.8628 6.5370 6.2494 10.8875 3.3896 4.5342 6.4720 2.0410 5.0791 5.0014 8.3903 6.4406 7.8153 3.0042 1.1170 1.1095 4.7509 4.1873 1.2993 1.6176 3.7953 1.4339 1.4281 1.4296 8.4863 2.5706 2.0996 5.6371 1.3250 3.3951 2.2520 2.9968 2.8102 2.9732 1.8269 1.9013 1.9664 2.3151 2.2567 4.7307 1.4670 1.4644 5.6084 1.0546 1.1215 6.5372 1.1365 1.1345 1.2195 4.3399 1.7214 3.0347 1.3976 1.5065 6.7524 10.0737 1.3515 1.9482 1.8554 3.1172 2.3625 4.2796 1.0412 1.0431 4.4740 1.1419 1.1290 2.1572 1.0964 1.1340 7.7024 8.0782 5.9915 7.4478 6.1756 12.0309 11.9295 1.0357 1.0360 1.0581 1.0582 1.1068 1.1060 1.0986 1.0985 1.1032 1.1025 1.0853 1.0889 1.0942 1.0983 1.0979 1.0938 1.0931 1.0942
irintensity: 1.6995 0.2038 0.3936 1.2732 0.1343 0.6254 0.3719 0.4543 0.6846 0.1155 0.6739 0.4704 2.4990 0.3135 0.0849 0.4686 1.3691 1.0131 2.7805 2.1178 1.5733 4.3709 1.5739 2.5688 1.7405 1.3621 4.4708 9.3214 15.6025 5.9821 2.2774 5.0319 0.4151 0.0528 7.3875 2.3339 1.5040 0.8806 0.1185 10.8199 2.5863 0.0928 8.4129 6.2240 18.3344 4.7361 2.8484 43.3974 51.0369 7.4230 77.4393 8.2961 13.1177 41.3635 3.4561 2.8207 16.8043 1.8758 3.1010 36.0068 18.6093 11.2173 13.1729 9.2828 13.5109 4.7771 7.4120 2.7174 0.8942 81.4926 40.4550 182.0599 260.8002 134.3171 36.1454 50.9723 47.8610 2.6807 3.8205 62.7103 5.4150 5.3835 105.9877 0.1245 0.6860 277.0913 0.8250 0.2643 4.0862 168.2386 12.6480 40.0141 4.8504 0.4954 2.0021 1.3508 55.4191 73.9261 21.4266 35.5053 9.1269 103.0326 12.6039 11.8667 38.7949 15.0095 3.7401 15.8513 7.0498 25.8375 48.9926 89.5497 2.5105 230.5726 3.1438 138.3404 259.9868 19.7267 21.1364 20.0981 16.9736 7.4971 2.6778 34.6451 31.9054 41.6527 39.3045 1.1019 3.5269 23.0336 20.0977 6.3437 2.6932 4.1540 0.8197
temp: 298.150 k
press: 1.00000 atm
elementType: 17 17 8 8 8 8 7 7 6 6 6 6 6 6 6 6 6 6 6 6 6 6 6 6 6 6 6 6 6 1 1 1 1 1 1 1 1 1 1 1 1 1 1 1 1 1 1
symmnumber: 1
zpe: 907204.2 jmol-1
zpe.correction: 0.345536 hartree
zpe.thermalcorrener: 0.373739 hartree
zpe.thermalcorrenthalpy: 0.374683 hartree
zpe.thermalcorrgfe: 0.282113 hartree
zpe.sumelectzpe: -2139.476891 hartree
zpe.sumelectthermal: -2139.448688 hartree
zpe.sumelectthermalent: -2139.447744 hartree
zpe.sumelectthermalfe: -2139.540314 hartree
dipole: -0.5802 -3.0010 0.2246
dipole: 3.0648
quadrupole: -186.0352 -152.1881 -182.6594
quadrupole: -0.6752 -7.5691 -0.7348
quadrupole: -12.4077 21.4395 -9.0318 -0.6752 -7.5691 -0.7348
hfenergy: -2139.8224269 hartree
pointgroup: C01 [X(C21H18Cl2N2O4)]
dipole: 0.5934715 1.0486128 -0.046159 debye
polarizability: 350.4508069|6.7848642|339.3251752|2.7936252|-44.0242763|177.309306 unknown
InChI: InChI=1S/C21H18Cl2N2O4/c1-3-28-20(26)17-18(21(27)29-4-2)24-25(16-11-14(22)10-15(23)12-16)19(17)13-8-6-5-7-9-13/h5-12H,3-4H2,1-2H3
charge 0 multiplicity 1
47 atoms
Cl 3.688045 -4.688613 1.099611
Cl 5.443363 -0.189878 -1.638097
O  -2.196267 2.62454 -0.779441
O  -3.114746 -2.795707 0.297246
O  -3.328356 1.558693 0.958365
O  -4.023325 -0.948337 -0.807482
N  0.461924 -0.750191 -0.053009
N  -0.58063 -1.677213 -0.098119
C  0.002526 0.579907 -0.020968
C  -1.403435 0.48853 -0.062793
C  0.890639 1.744495 0.203393
C  -1.708516 -0.914988 -0.09555
C  1.800572 -1.264739 -0.114988
C  -2.403297 1.572367 0.114321
C  1.767559 1.75865 1.323235
C  0.873911 2.856927 -0.677839
C  2.827469 -0.541866 -0.768071
C  2.048463 -2.538207 0.452153
C  -3.057572 -1.520325 -0.246809
C  2.616112 2.861411 1.550959
C  1.729454 3.956886 -0.448478
C  3.350576 -3.057325 0.372032
C  4.112632 -1.109893 -0.807265
C  2.603729 3.962762 0.662734
C  4.412168 -2.366157 -0.246152
C  -3.170589 3.758193 -0.670302
C  -4.42591 -3.504016 0.145943
C  -2.782862 4.776542 -1.736777
C  -4.263386 -4.865886 0.811299
H  1.77262 0.913299 2.020268
H  0.189237 2.85227 -1.530214
H  2.633777 0.422882 -1.239053
H  1.232815 -3.092453 0.9202
H  3.283198 2.862968 2.419508
H  1.714821 4.806916 -1.139324
H  3.267435 4.816697 0.837025
H  5.418447 -2.787837 -0.293253
H  -3.110924 4.168346 0.353847
H  -4.18529 3.348346 -0.820323
H  -4.654583 -3.580269 -0.932686
H  -5.207824 -2.885374 0.622142
H  -3.482521 5.631609 -1.707229
H  -1.761936 5.160061 -1.565541
H  -2.826982 4.328248 -2.744046
H  -4.017354 -4.754379 1.880934
H  -3.459566 -5.446605 0.327915
H  -5.206125 -5.436789 0.727779
