program: Gaussian 09
title: 000178838
version: EM64L-G09RevD.01
frameworkgroup: C1[X(C10H12ClN3O4S)]
method: RPBEPBE
basis: SDD
operation: Freq
keyword: #p
keyword: freq=noraman
keyword: PBEPBE/SDD
title: #p freq=noraman PBEPBE/SDD
converged: YES YES NO NO
title: Mulliken charges:
elementType: Cl S O O O O N N N C C C C C C C C C C H H H H H H H H H H H H
charge: -0.037973 0.948670 -0.541207 -0.538677 -0.254683 -0.221036 -0.411490 -0.716761 0.142992 -0.070955 0.495947 -0.197712 -0.198845 -0.399499 -0.338466 -0.219135 -0.669678 -0.394558 0.394466 0.284912 0.283151 0.241617 0.293819 0.304310 0.335783 0.335215 0.234766 0.234536 0.215182 0.232146 0.233164
chargesum: 0.00000
title: Mulliken charges with hydrogens summed into heavy atoms:
elementType: Cl S O O O O N N N C C C C C C C C C C
charge: -0.037973 0.948670 -0.541207 -0.538677 -0.254683 -0.221036 -0.107180 -0.045763 0.142992 -0.070955 0.495947 0.087199 0.084306 -0.157882 -0.044647 0.250167 0.010813 -0.394558 0.394466
polarizability: 3.47148571e+02 7.24157161e+00 1.95894681e+02 2.85258864e+00 2.43754959e-01 9.85308785e+01
1716.lowfreq: -5.1441 -2.0170 -0.0015 0.0019 0.0020 3.3003 16.9944 24.1772 33.7302
frequency: 16.4843 24.0282 33.7188 38.6568 46.6956 66.0715 93.7775 97.7101 103.7041 120.2316 137.8827 155.8405 182.7364 226.9237 236.0558 239.0140 261.7810 269.0992 296.5926 298.8454 337.2586 359.1537 374.8148 400.3759 414.5552 438.4684 472.7223 481.9438 485.0817 537.7110 591.7755 619.8435 680.7287 682.0534 698.6049 723.9733 735.1694 795.0929 798.1992 804.1234 809.5036 831.4753 845.7563 859.7483 908.3228 965.6492 973.5451 988.2500 991.4067 1025.6851 1054.7796 1070.7503 1107.0509 1112.8379 1130.5085 1133.5781 1176.7875 1205.0926 1248.3859 1287.7746 1306.0837 1356.0973 1387.5204 1401.5725 1414.5724 1463.1723 1472.1592 1474.5479 1485.6922 1511.2010 1534.5428 1588.1673 1602.4105 1611.4823 1615.5443 2997.7878 3011.1621 3071.2059 3094.6997 3110.2564 3136.6581 3159.6906 3167.2809 3185.2168 3363.2222 3395.0043 3530.6584
redmass: 5.0744 3.6161 5.6107 6.4638 3.2077 5.8158 3.9044 6.1984 1.6624 3.3618 11.1880 7.8135 5.9588 6.1999 3.7629 2.8841 2.1624 2.4878 7.3125 7.5910 7.1148 5.5244 5.9651 5.1605 2.9383 9.8809 3.7941 4.9593 6.9033 2.8707 7.9376 7.1624 5.4984 1.5713 6.7624 7.9620 3.5420 2.8533 1.1017 3.4566 3.2065 1.3477 4.5045 1.5023 4.0467 1.3750 5.3632 4.4911 1.3750 2.8362 2.5439 1.4868 2.8275 2.1010 1.9452 1.4532 1.1553 4.2724 1.1378 1.3855 1.9789 1.4238 5.0458 1.2717 4.1816 1.0400 1.0693 2.0841 1.0655 2.0711 1.0853 9.4166 6.3419 7.0847 11.3885 1.0359 1.0580 1.1069 1.0985 1.1027 1.0899 1.0901 1.0958 1.0960 1.0414 1.0755 1.1000
irintensity: 0.3012 1.2731 0.6896 1.6747 4.6313 0.8360 4.1800 1.9462 33.5406 5.2336 0.0134 0.4084 0.6967 15.4828 1.5216 0.7290 1.1172 2.3271 23.5042 14.8476 20.1093 4.6364 4.8654 10.3609 0.0830 63.3980 129.5929 32.8545 2.0961 90.5223 33.8370 1.0621 34.7783 44.0758 36.7632 35.2699 1.3221 25.9142 3.4200 67.8638 230.8765 29.5380 5.8517 49.7628 62.0348 0.5723 220.2837 3.6563 1.0457 184.6991 52.6621 20.0681 204.0963 15.0866 252.2123 6.3157 43.3797 258.7687 0.0051 23.8216 57.1101 1.6796 5.4620 23.8495 13.9467 12.8534 7.1716 48.5386 13.4728 202.0957 18.1463 641.1877 72.4685 42.4305 162.0509 15.6651 20.3625 7.3317 29.5498 40.5579 7.6405 1.0108 4.7866 1.2947 30.0876 20.9286 24.6788
temp: 298.150 k
press: 1.00000 atm
elementType: 17 16 8 8 8 8 7 7 7 6 6 6 6 6 6 6 6 6 6 1 1 1 1 1 1 1 1 1 1 1 1
symmnumber: 1
zpe: 571527.9 jmol-1
zpe.correction: 0.217683 hartree
zpe.thermalcorrener: 0.238564 hartree
zpe.thermalcorrenthalpy: 0.239508 hartree
zpe.thermalcorrgfe: 0.164127 hartree
zpe.sumelectzpe: -1709.908751 hartree
zpe.sumelectthermal: -1709.887871 hartree
zpe.sumelectthermalent: -1709.886927 hartree
zpe.sumelectthermalfe: -1709.962308 hartree
dipole: -1.1015 0.5319 2.8585
dipole: 3.1092
quadrupole: -152.1983 -112.3312 -128.5300
quadrupole: -17.7837 20.3160 3.3843
quadrupole: -21.1784 18.6886 2.4898 -17.7837 20.3160 3.3843
hfenergy: -1710.1264347 hartree
pointgroup: C01 [X(C10H12Cl1N3O4S1)]
dipole: -0.4529747 0.1950779 1.1194152 debye
polarizability: 343.2251639|25.2065555|199.7405037|1.3770013|-3.0430707|98.6084629 unknown
InChI: InChI=1S/C10H12ClN3O4S/c1-2-18-10(15)9(11)14-13-7-3-5-8(6-4-7)19(12,16)17/h3-6,13H,2,12H2,1H3
charge 0 multiplicity 1
31 atoms
Cl -3.356744 -3.341211 0.033307
S  4.700084 0.825515 -0.305717
O  5.731563 -0.318037 -0.838782
O  4.539261 2.293116 -0.994197
O  -4.103992 0.655571 -0.145344
O  -5.519034 -1.205024 -0.039732
N  -0.795105 -1.71536 -0.074887
N  5.137295 1.124621 1.460722
N  -1.920898 -0.969764 -0.096192
C  2.996795 0.051109 -0.215925
C  0.473837 -1.100394 -0.123185
C  2.907778 -1.34861 -0.148588
C  1.873833 0.895593 -0.249578
C  1.626714 -1.929739 -0.102718
C  0.594563 0.312702 -0.202935
C  -5.317702 1.536508 -0.171822
C  -4.80987 2.971956 -0.23321
C  -3.10726 -1.497413 -0.05625
C  -4.3700 -0.707901 -0.077599
H  3.813322 -1.962914 -0.157937
H  2.000008 1.97944 -0.33496
H  1.52491 -3.020052 -0.054848
H  -0.309504 0.925595 -0.229853
H  -0.874105 -2.742441 -0.026005
H  5.993154 0.583013 1.668842
H  5.260605 2.14318 1.588796
H  -5.924706 1.259509 -1.052618
H  -5.91236 1.331028 0.736498
H  -5.667948 3.668073 -0.256282
H  -4.19247 3.210835 0.649255
H  -4.203525 3.138196 -1.139656
