program: Gaussian 09
title: 000178824
version: EM64L-G09RevD.01
frameworkgroup: C1[X(C12H15NO2)]
method: RPBEPBE
basis: SDD
operation: Freq
keyword: #p
keyword: freq=noraman
keyword: PBEPBE/SDD
title: #p freq=noraman PBEPBE/SDD
converged: YES YES NO NO
title: Mulliken charges:
elementType: O O N C C C C C C C C C C C C H H H H H H H H H H H H H H H
charge: -0.438919 -0.259208 -0.131993 -0.080096 -0.412387 -0.561122 0.179798 -0.389679 -0.560350 0.494804 -0.431663 -0.367904 -0.221724 -0.229820 -0.239539 0.267585 0.238381 0.219794 0.258412 0.235175 0.189789 0.232862 0.225295 0.263743 0.342143 0.231246 0.259061 0.227280 0.228594 0.230441
chargesum: 0.00000
title: Mulliken charges with hydrogens summed into heavy atoms:
elementType: O O N C C C C C C C C C C C C
charge: -0.096776 -0.259208 -0.131993 0.187489 0.045788 -0.067535 0.179798 0.032971 -0.071311 0.494804 -0.200417 -0.108842 0.005557 -0.001226 -0.009098
polarizability: 1.51137393e+02 2.34484126e+01 1.29309946e+02 -2.51663435e+00 1.15801658e+01 1.21492709e+02
1716.lowfreq: -6.5168 -0.0006 -0.0004 0.0005 7.0143 11.5017 20.6789 29.3321 44.3719
frequency: 20.4510 29.2632 44.2978 77.7261 94.7579 129.7293 187.4579 205.9670 228.5665 284.7969 296.3599 346.8373 348.7233 403.2425 411.2617 460.2102 504.2838 538.7576 599.7551 614.3098 617.3614 655.6778 707.1662 748.0773 784.5837 811.0209 840.2093 858.0175 906.0479 914.9732 922.8400 950.9506 964.3988 980.3089 989.6913 998.8964 1025.4154 1038.9782 1048.4869 1073.4064 1089.6235 1107.5697 1145.9826 1167.2681 1172.8874 1187.3909 1190.8522 1209.7963 1225.2216 1249.3181 1255.5513 1277.6646 1299.5517 1318.0156 1328.3510 1348.6228 1356.5883 1375.0552 1383.4511 1406.6881 1442.2174 1451.0662 1459.4989 1465.5170 1484.3695 1497.4230 1595.3402 1613.6881 1637.3914 2929.5736 2945.2683 2983.4808 2992.9447 3015.1562 3033.6149 3044.3301 3077.1722 3086.8891 3114.1881 3123.3466 3134.8308 3146.2205 3163.7709 3565.8416
redmass: 4.0261 5.3157 4.2699 4.0514 3.0844 3.4017 2.6528 3.5146 5.1826 3.9617 1.2490 3.4907 2.8740 2.8201 1.9720 3.1765 4.5020 2.8922 4.7048 4.0639 5.6555 5.2862 1.7824 2.2515 3.3747 3.3725 2.6513 1.2458 1.5018 1.4460 1.5146 1.9726 4.4717 1.3918 5.8339 1.3308 2.3491 3.2519 1.9901 1.8550 1.7401 2.2878 1.3277 1.4748 1.0594 1.1149 1.7033 2.5579 1.4144 1.4132 1.9800 1.5549 1.3938 1.2909 1.3210 1.4309 1.4079 1.2459 5.9341 2.4161 2.1095 1.0970 1.1208 1.0848 2.1954 1.1094 6.0707 6.0402 10.0959 1.0679 1.0690 1.0600 1.0673 1.0880 1.0905 1.1018 1.0957 1.0958 1.0876 1.0865 1.0913 1.0961 1.1015 1.0663
irintensity: 0.0563 0.3154 2.1654 8.2080 8.2463 0.6717 2.8485 5.6707 6.3299 8.3681 146.0107 2.4949 3.6166 0.1679 5.3730 4.7876 11.7494 7.2675 8.1733 3.2265 3.6498 15.8552 59.6763 35.3635 3.4202 8.1810 17.0005 0.0859 1.5216 3.6113 9.6864 7.0498 95.7078 0.0773 0.3926 0.7894 5.3921 2.5519 5.9414 27.8161 16.5208 5.1674 2.8297 21.7600 0.2417 1.3786 3.8520 6.5322 32.8779 21.7935 100.1452 6.3375 6.9947 16.9496 6.8172 11.1170 7.8082 22.6504 6.9998 49.4784 6.4133 7.6392 26.6805 7.3976 11.2082 9.2627 0.9208 4.8309 323.5245 52.6493 47.7759 39.8622 14.7392 3.6090 44.4958 8.3169 20.8751 23.4634 9.1156 0.7845 10.0508 35.1847 23.2452 7.6978
temp: 298.150 k
press: 1.00000 atm
elementType: 8 8 7 6 6 6 6 6 6 6 6 6 6 6 6 1 1 1 1 1 1 1 1 1 1 1 1 1 1 1
symmnumber: 1
zpe: 650540.3 jmol-1
zpe.correction: 0.247778 hartree
zpe.thermalcorrener: 0.261853 hartree
zpe.thermalcorrenthalpy: 0.262797 hartree
zpe.thermalcorrgfe: 0.204459 hartree
zpe.sumelectzpe: -670.361889 hartree
zpe.sumelectthermal: -670.347814 hartree
zpe.sumelectthermalent: -670.346870 hartree
zpe.sumelectthermalfe: -670.405208 hartree
dipole: -1.3121 -3.1027 -0.2593
dipole: 3.3787
quadrupole: -90.8491 -105.6820 -81.7281
quadrupole: 8.8607 0.7086 0.0578
quadrupole: 1.9040 -12.9289 11.0250 8.8607 0.7086 0.0578
hfenergy: -670.6096672 hartree
pointgroup: C01 [X(C12H15N1O2)]
dipole: -0.4154262 1.2541713 -0.146599 debye
polarizability: 147.8283847|-23.0907546|137.8877986|6.8374643|9.2315966|116.2238648 unknown
InChI: InChI=1S/C12H15NO2/c14-9-11-6-12(15)13(8-11)7-10-4-2-1-3-5-10/h1-5,11,14H,6-9H2
charge 0 multiplicity 1
30 atoms
O  3.713973 2.338836 -0.735514
O  0.848968 -2.957814 0.425199
N  0.739082 -0.633019 0.81053
C  2.852658 0.098498 -0.02362
C  1.45132 0.603313 0.445808
C  2.606741 -1.379237 -0.429627
C  1.322737 -1.79169 0.305956
C  3.456173 0.950814 -1.151731
C  -0.55731 -0.634749 1.504345
C  -1.674647 0.008184 0.685002
C  -2.338378 1.171928 1.143026
C  -2.060252 -0.560658 -0.556882
C  -3.371675 1.761434 0.377083
C  -3.089312 0.026499 -1.324301
C  -3.748198 1.190686 -0.859691
H  3.541791 0.130662 0.840102
H  1.517727 1.28516 1.313852
H  0.91156 1.137396 -0.367722
H  3.433269 -2.056574 -0.161477
H  2.431796 -1.489011 -1.518867
H  2.79532 0.916794 -2.04635
H  4.448583 0.563709 -1.437213
H  -0.451931 -0.115071 2.476743
H  -0.782315 -1.699912 1.703728
H  2.851672 2.811282 -0.616941
H  -2.049701 1.617149 2.103847
H  -1.556612 -1.468944 -0.909497
H  -3.879936 2.660355 0.743896
H  -3.384105 -0.424658 -2.278519
H  -4.548998 1.644339 -1.454366
