program: Gaussian 09
title: 000178857
version: EM64L-G09RevD.01
frameworkgroup: C1[X(C20H17ClN2O4)]
method: RPBEPBE
basis: SDD
operation: Freq
keyword: #p
keyword: freq=noraman
keyword: PBEPBE/SDD
title: #p freq=noraman PBEPBE/SDD
converged: YES YES NO NO
title: Mulliken charges:
elementType: Cl O O O O N N C C C C C C C C C C C C C C C C C C C C H H H H H H H H H H H H H H H H H
charge: -0.054326 -0.272390 -0.249179 -0.222305 -0.232922 -0.338652 -0.022164 0.260835 -0.057135 0.295866 -0.059576 0.456725 0.166055 -0.359471 -0.365298 -0.295116 -0.395654 0.185583 -0.227904 -0.238917 -0.086219 -0.188783 -0.234819 -0.250413 -0.214254 -0.680288 -0.499315 0.255251 0.272976 0.297545 0.287988 0.233560 0.232384 0.239070 0.234272 0.260880 0.239356 0.229561 0.215235 0.225483 0.232660 0.241393 0.247149 0.235269
chargesum: 0.00000
title: Mulliken charges with hydrogens summed into heavy atoms:
elementType: Cl O O O O N N C C C C C C C C C C C C C C C C C C C C
charge: -0.054326 -0.272390 -0.249179 -0.222305 -0.232922 -0.338652 -0.022164 0.260835 -0.057135 0.295866 -0.059576 0.456725 0.166055 -0.104220 -0.092323 0.002429 -0.107665 0.185583 0.005655 -0.006532 -0.086219 0.050287 -0.000547 0.010467 0.254664 -0.006909 0.224495
polarizability: 3.30434683e+02 1.56780919e+01 2.99427203e+02 1.06523838e+01 -2.38122017e+01 1.59632492e+02
1716.lowfreq: -7.8350 -5.7808 -2.3923 0.0017 0.0018 0.0025 3.5085 22.1386 26.2608
frequency: -4.0326 22.1269 26.2397 35.6910 46.0121 52.5759 55.7100 58.9511 75.1154 91.0353 106.2372 110.6088 124.0300 134.3537 178.0266 183.2848 186.0309 212.4260 225.4207 247.2757 251.1384 257.2926 265.2217 274.6759 320.2031 350.8072 362.0760 375.0848 399.3427 405.0247 434.2416 444.3035 478.8691 491.9558 539.5927 562.1630 613.2968 621.0861 636.6774 662.0867 670.6527 684.5863 697.7236 702.5766 736.6186 738.7047 763.0448 771.5340 785.1158 790.0664 799.4448 819.8998 830.2298 856.3738 880.5896 907.7881 914.7114 932.3795 961.1219 978.8417 981.1394 984.0361 989.8219 1000.8601 1013.9915 1025.8674 1034.0088 1068.0560 1077.9758 1085.6222 1089.3684 1111.8482 1112.5842 1127.0659 1134.4962 1145.8241 1149.6713 1175.5283 1176.6344 1195.5507 1213.4034 1248.7551 1286.5360 1294.5009 1320.9255 1344.1682 1354.6929 1372.7997 1381.3799 1398.2294 1401.9731 1418.7405 1427.0800 1434.0342 1451.8562 1459.3687 1462.7165 1464.0222 1472.4320 1475.6127 1479.3234 1486.6543 1538.3449 1582.6918 1583.9536 1605.0231 1614.3061 1622.3228 1639.2378 2994.1897 3004.3672 3014.1398 3072.1042 3091.1154 3105.7570 3106.1447 3129.7400 3136.9779 3149.8615 3151.5406 3151.6319 3165.1698 3176.7925 3179.0247 3187.3906 3190.0381
redmass: 4.4344 7.5090 5.2664 4.8473 5.8941 4.5191 3.2698 4.7355 2.9419 1.2661 5.2391 4.8229 3.6578 4.6982 5.3046 3.7131 5.4343 4.8427 5.1306 3.8057 5.9321 3.2475 2.2022 4.9819 5.0937 5.5486 5.0715 5.5826 10.1740 2.8407 4.7815 4.2861 5.0551 6.4908 7.0914 6.1432 6.5504 6.6667 9.7705 7.5847 5.4823 2.7734 5.1172 2.1966 4.2033 7.2078 4.0932 6.8182 2.6965 1.5449 1.1364 6.6795 4.3862 1.2479 1.4258 1.4283 5.8645 1.4852 7.9255 1.3510 1.4835 5.0592 5.7406 1.3216 3.0630 3.2554 2.9200 3.9047 1.8772 2.0878 1.7512 2.2835 1.2678 5.0962 1.4689 3.2065 1.6844 1.0545 1.0815 1.1223 6.9520 1.1359 1.3321 4.6151 1.5310 3.7595 1.4503 6.5070 9.7664 1.2774 3.3088 1.6013 2.6557 2.2750 1.0502 2.2882 1.2685 1.0414 1.1502 2.7331 2.4759 1.1598 7.6068 6.4701 6.6097 6.8160 6.1580 11.0713 11.4514 1.0356 1.0296 1.0582 1.1060 1.0987 1.1032 1.1045 1.0852 1.0890 1.0943 1.1004 1.0925 1.0986 1.0944 1.0973 1.0942 1.0967
irintensity: 1.5324 1.1047 0.1132 1.9981 0.2559 0.1676 1.2535 1.1517 0.1729 0.2846 0.4417 0.1135 2.7017 0.8205 1.8281 2.9921 0.6050 2.9196 0.6351 0.4435 4.0438 0.8063 4.3112 14.2721 13.2553 2.0898 10.3585 2.6575 7.1409 0.0280 0.3834 5.3004 2.1744 0.7274 10.2252 1.1343 0.1911 4.6604 5.0370 3.5141 10.0620 16.3364 5.3142 44.8684 41.7817 40.0654 8.1574 2.9325 28.7129 49.7180 3.8567 30.0988 3.7807 1.3869 21.6486 1.5420 18.2528 8.3100 22.5692 0.9078 2.3951 3.4189 1.5447 0.7920 51.5073 166.3547 192.2883 78.9258 33.5092 57.1152 18.0552 4.0085 0.6121 95.0320 4.4577 42.9058 85.6655 0.0980 1.1590 0.6792 251.2565 0.8961 2.5030 125.4666 7.6613 59.2105 1.1586 4.6715 0.3218 28.8558 52.2653 47.0620 10.3090 10.3076 14.6479 65.8996 26.5954 11.6152 16.5691 78.3349 11.1827 17.0759 28.4280 18.3966 23.5568 97.8452 3.8211 128.1049 286.1180 19.4683 40.9623 17.3391 2.7200 35.3336 40.4390 25.4437 1.2048 3.7923 24.1784 3.6633 19.8908 21.3720 3.6327 5.3274 0.4812 1.3216
temp: 298.150 k
press: 1.00000 atm
elementType: 17 8 8 8 8 7 7 6 6 6 6 6 6 6 6 6 6 6 6 6 6 6 6 6 6 6 6 1 1 1 1 1 1 1 1 1 1 1 1 1 1 1 1 1
symmnumber: 1
zpe: 859273.5 jmol-1
zpe.correction: 0.327280 hartree
zpe.thermalcorrener: 0.351956 hartree
zpe.thermalcorrenthalpy: 0.352900 hartree
zpe.thermalcorrgfe: 0.270038 hartree
zpe.sumelectzpe: -1640.860548 hartree
zpe.sumelectthermal: -1640.835872 hartree
zpe.sumelectthermalent: -1640.834928 hartree
zpe.sumelectthermalfe: -1640.917790 hartree
dipole: 2.1284 1.2752 0.7177
dipole: 2.5829
quadrupole: -164.0977 -130.9261 -163.7333
quadrupole: -4.3237 11.4575 -5.3304
quadrupole: -11.1787 21.9929 -10.8142 -4.3237 11.4575 -5.3304
hfenergy: -1641.187828 hartree
pointgroup: C01 [X(C20H17Cl1N2O4)]
dipole: 0.7774959 0.6095054 0.2379903 debye
polarizability: 326.1081768|21.4367362|294.4718772|16.9149641|-39.3400444|168.9143241 unknown
InChI: InChI=1S/C20H17ClN2O4/c1-3-27-19(24)16-17(20(25)26-2)22-23(15-11-7-10-14(21)12-15)18(16)13-8-5-4-6-9-13/h4-12H,3H2,1-2H3
charge 0 multiplicity 1
44 atoms
Cl 5.475529 0.64352 -1.234496
O  -2.630314 1.738361 -0.893225
O  -2.381078 -3.658867 0.57663
O  -3.596626 0.572846 0.87987
O  -3.60908 -2.141321 -0.70303
N  0.666567 -0.884432 0.239704
N  -0.138457 -2.022813 0.220815
C  -0.076055 0.305918 0.137821
C  -1.422358 -0.102023 0.037118
C  0.517488 1.654144 0.295733
C  -1.406114 -1.536493 0.106507
C  2.089947 -1.084961 0.287735
C  -2.647952 0.7353 0.07828
C  1.315448 1.950258 1.435257
C  0.294743 2.665871 -0.674643
C  2.963448 -0.217979 -0.411274
C  2.591244 -2.19706 1.005364
C  -2.573884 -2.437139 -0.059995
C  1.884974 3.230259 1.59468
C  0.870848 3.944913 -0.512964
C  4.343917 -0.473012 -0.34212
C  3.981912 -2.425823 1.041054
C  1.668392 4.23152 0.618643
C  4.879976 -1.560702 0.373094
C  -3.838961 2.623384 -0.921194
C  -3.617022 3.637506 -2.038327
C  -3.490128 -4.630293 0.41434
H  1.478437 1.181526 2.198707
H  -0.329237 2.443321 -1.544347
H  2.5838 0.620247 -0.998345
H  1.88951 -2.868204 1.50595
H  2.494608 3.446645 2.478431
H  0.699637 4.715333 -1.272762
H  4.375256 -3.283921 1.595283
H  2.116055 5.223952 0.740596
H  5.959538 -1.730793 0.403287
H  -4.722871 1.984102 -1.094646
H  -3.944393 3.097835 0.071014
H  -4.492925 4.307437 -2.112376
H  -2.72469 4.256196 -1.839561
H  -3.485711 3.130906 -3.009767
H  -3.625614 -4.880108 -0.651592
H  -4.42837 -4.206007 0.809372
H  -3.174732 -5.509849 0.992077
