program: Gaussian 09
title: 000178827
version: EM64L-G09RevD.01
frameworkgroup: C1[X(C12H16O4)]
method: RPBEPBE
basis: SDD
operation: Freq
keyword: #pfreq=noraman
keyword: PBEPBE/SDD
title: #p freq=noraman PBEPBE/SDD
converged: YES YES NO NO
title: Mulliken charges:
elementType: O O O O C C C C C C C C C C C C H H H H H H H H H H H H H H H H
charge: -0.284255 -0.219900 -0.239757 -0.241472 0.028239 0.285677 0.240328 -0.496340 0.189795 -0.690218 -0.691458 0.221882 -0.498480 -0.232258 -0.536897 -0.536559 0.193741 0.255031 0.205606 0.237753 0.227989 0.214936 0.242066 0.234167 0.291570 0.206651 0.220651 0.222319 0.254186 0.225595 0.225416 0.243999
chargesum: 0.00000
title: Mulliken charges with hydrogens summed into heavy atoms:
elementType: O O O O C C C C C C C C C C C C
charge: -0.284255 -0.219900 -0.239757 -0.241472 0.221980 0.285677 0.240328 -0.241310 0.189795 -0.018870 -0.000289 0.221882 -0.206910 -0.025607 0.160259 0.158450
polarizability: 1.95003429e+02 1.67690185e+00 1.94018803e+02 -2.01742408e+00 1.82250326e+00 8.52860877e+01
1716.lowfreq: -5.7820 -2.1765 -0.0007 -0.0006 -0.0004 5.4561 36.6462 58.7370 75.1427
frequency: 36.6161 58.7325 75.1206 92.1117 106.2378 139.1613 151.3094 159.0473 179.9580 185.7938 193.9408 211.7797 221.8875 243.0754 251.6780 281.4176 294.7240 317.7036 357.7992 406.4700 415.8032 433.3836 460.5979 471.8584 533.1373 563.8528 613.2657 677.8053 693.8074 725.9202 742.5821 804.8327 838.4224 870.2954 904.0357 922.2578 926.4802 940.9409 963.4183 990.9618 994.3302 1103.5525 1106.8757 1110.4075 1113.3473 1149.6392 1156.2297 1162.7722 1175.3179 1184.2386 1190.5549 1258.8095 1286.5515 1317.1424 1342.5883 1364.1821 1381.9215 1396.7262 1399.8466 1412.9821 1436.5751 1443.5991 1456.1546 1465.3861 1467.4735 1468.6038 1469.2429 1469.7895 1471.6211 1489.5868 1504.6307 1567.6205 1585.5609 1615.4892 2959.1365 2960.5353 2961.2652 2970.7227 2990.0740 2995.9314 3048.8723 3050.7337 3086.0507 3095.3125 3097.7872 3105.0242 3127.9090 3131.3273 3156.3354 3181.4274
redmass: 3.5466 4.5437 2.8909 3.2481 3.3219 4.7039 5.5662 4.1528 3.3578 1.0707 2.0566 1.4873 1.5614 1.7526 1.3403 2.1600 3.4258 4.4087 3.4435 3.5572 3.7059 6.2091 3.3631 2.8354 5.3494 6.1282 4.8092 7.5568 5.1710 5.6039 1.8867 3.6944 2.3031 3.1853 1.4289 3.1894 1.3223 1.3382 8.0048 1.8364 5.1022 2.0733 3.0366 1.2623 1.2618 2.0606 1.4535 1.5608 1.8367 2.1350 4.8131 1.3775 4.4877 1.3788 1.3974 1.5337 1.2454 2.6108 1.3885 4.8027 1.2050 1.3690 1.0521 1.0494 1.0818 1.0652 1.0495 1.0572 1.0643 1.0595 2.6916 8.5758 6.8202 6.5360 1.0823 1.0359 1.0340 1.0844 1.0359 1.0361 1.1039 1.1040 1.0990 1.0999 1.0998 1.1005 1.0996 1.0993 1.0902 1.0895
irintensity: 1.0831 0.0621 2.4198 8.5518 0.0765 3.5484 8.2673 8.9570 3.3806 0.0740 2.2016 1.7740 1.2888 0.9856 0.1390 0.5491 2.0192 4.5531 2.2587 6.1543 5.0290 3.1474 4.3447 3.6929 7.4697 22.1161 6.7676 0.3942 8.1501 32.6358 1.8792 0.6572 32.7654 20.5352 18.4885 44.3035 8.5206 0.3540 79.4389 5.2346 50.2472 99.9437 98.3546 0.3224 0.1389 10.5450 36.5548 21.1404 16.0310 243.0284 140.5515 39.0189 320.3737 41.8925 11.0718 39.0108 35.8956 49.4400 84.3454 21.5113 44.6394 29.9792 4.4165 12.5600 33.7640 23.3071 22.3975 34.3909 51.8523 13.7908 242.8226 129.7329 316.7175 14.3821 60.2918 122.4745 2.3729 35.7650 15.4888 21.7527 37.6704 51.9537 14.8745 30.2775 30.8717 31.8017 22.9844 20.1613 6.8462 9.0784
temp: 298.150 k
press: 1.00000 atm
elementType: 8 8 8 8 6 6 6 6 6 6 6 6 6 6 6 6 1 1 1 1 1 1 1 1 1 1 1 1 1 1 1 1
symmnumber: 1
zpe: 675268.1 jmol-1
zpe.correction: 0.257196 hartree
zpe.thermalcorrener: 0.274549 hartree
zpe.thermalcorrenthalpy: 0.275493 hartree
zpe.thermalcorrgfe: 0.212345 hartree
zpe.sumelectzpe: -766.502443 hartree
zpe.sumelectthermal: -766.485090 hartree
zpe.sumelectthermalent: -766.484146 hartree
zpe.sumelectthermalfe: -766.547294 hartree
dipole: 2.4675 -5.8060 -0.0562
dipole: 6.3089
quadrupole: -79.2684 -102.8643 -96.1412
quadrupole: -9.1771 -0.3826 0.5688
quadrupole: 13.4896 -10.1063 -3.3832 -9.1771 -0.3826 0.5688
hfenergy: -766.7596388 hartree
pointgroup: C01 [X(C12H16O4)]
dipole: 0.8458784 2.3299127 0.1295907 debye
polarizability: 194.409269|-1.9425632|193.7187322|9.3113826|4.1138707|86.1803185 unknown
InChI: InChI=1S/C12H16O4/c1-8(2)16-10-6-12(15-4)11(14-3)5-9(10)7-13/h5-8H,1-4H3
charge 0 multiplicity 1
32 atoms
O  2.232866 -0.471114 0.455628
O  -1.862642 2.314819 0.168347
O  -3.354334 0.14991 -0.121563
O  -0.004443 -3.86343 -0.02562
C  3.159535 0.696319 0.522191
C  0.855238 -0.275749 0.293308
C  0.06346 -1.449535 0.135728
C  0.232452 0.999048 0.304161
C  -1.169531 1.107789 0.166969
C  4.444272 0.138503 1.142565
C  3.375866 1.284305 -0.883474
C  -1.978808 -0.069986 0.009579
C  -1.347801 -1.318963 -0.002594
C  0.666283 -2.794945 0.111685
C  -1.09031 3.550049 0.330219
C  -4.192037 -1.04185 -0.28488
H  2.720224 1.45427 1.20395
H  0.827749 1.905821 0.425012
H  5.19621 0.940943 1.248458
H  4.241709 -0.289976 2.138577
H  4.865596 -0.655475 0.5017
H  4.056395 2.153912 -0.831627
H  2.428305 1.612266 -1.344157
H  3.83246 0.524952 -1.542081
H  -1.907027 -2.253052 -0.118753
H  1.772364 -2.827412 0.221609
H  -0.36629 3.682607 -0.497224
H  -0.55891 3.566937 1.30152
H  -1.838028 4.355365 0.301704
H  -4.110749 -1.713453 0.591841
H  -3.922319 -1.600084 -1.202473
H  -5.219254 -0.658491 -0.368503
