program: Gaussian 09
title: 000178860
version: EM64L-G09RevD.01
frameworkgroup: C1[X(C22H19F3N2O4)]
method: RPBEPBE
basis: SDD
operation: Freq
keyword: #p
keyword: freq=noraman
keyword: PBEPBE/SDD
title: #p freq=noraman PBEPBE/SDD
converged: YES YES NO NO
title: Mulliken charges:
elementType: F F F O O O O N N C C C C C C C C C C C C C C C C C C C C C C H H H H H H H H H H H H H H H H H H H
charge: -0.168756 -0.158863 -0.138282 -0.254683 -0.245342 -0.225456 -0.235651 -0.352410 -0.017580 0.275036 -0.017590 0.384770 0.338215 -0.090407 0.133540 -0.320608 0.142854 -0.398756 -0.361761 -0.324061 0.257644 0.200687 -0.214652 -0.227126 -0.232301 -0.236738 -0.239206 -0.216082 -0.218140 -0.674448 -0.671766 0.271563 0.251773 0.256114 0.270188 0.243873 0.244453 0.233342 0.232955 0.233814 0.238565 0.221430 0.231741 0.229409 0.208355 0.235002 0.230577 0.207849 0.230756 0.236157
chargesum: 0.00000
title: Mulliken charges with hydrogens summed into heavy atoms:
elementType: F F F O O O O N N C C C C C C C C C C C C C C C C C C C C C C
charge: -0.168756 -0.158863 -0.138282 -0.254683 -0.245342 -0.225456 -0.235651 -0.352410 -0.017580 0.275036 -0.017590 0.384770 0.338215 -0.090407 0.133540 -0.049045 0.142854 -0.146982 -0.105647 -0.053873 0.257644 0.200687 0.029220 0.017327 0.001041 -0.003783 -0.005392 0.243913 0.243009 -0.000515 0.002996
polarizability: 3.14068011e+02 1.27964586e+01 3.12526645e+02 1.18377682e+00 9.86504946e+00 1.94434739e+02
1716.lowfreq: -19.9014 -6.7797 -5.6026 -3.6069 0.0005 0.0006 0.0007 18.1029 23.2902
frequency: -19.5227 18.0167 23.1869 25.9148 34.7712 40.7302 43.2579 47.7757 51.4979 56.8611 60.0213 90.6609 95.3730 102.8726 109.8024 127.1392 157.4741 163.9611 188.4321 200.6341 217.2630 231.8837 234.5516 244.7649 249.9436 258.6790 283.6179 297.8400 330.1860 343.8088 348.9695 364.9695 376.5061 398.9614 404.0172 411.3871 435.3920 477.4390 498.0584 515.3003 534.2327 551.3069 565.5590 606.5465 610.9128 619.0697 642.4120 667.9889 680.9766 688.9669 702.0042 727.2400 742.0933 752.1249 764.8354 774.6412 778.0104 781.3087 797.0099 799.7540 811.0148 831.8005 852.2022 856.4814 889.1619 931.0089 956.0888 967.3829 981.6000 985.0376 988.8697 996.7572 1000.1982 1001.0204 1009.1771 1009.7779 1019.7034 1026.7709 1035.4192 1041.7599 1074.0389 1085.1218 1112.5787 1113.7562 1118.4969 1128.3389 1133.1125 1134.6417 1160.3537 1175.0193 1183.1593 1193.4742 1220.4541 1246.5898 1248.9851 1255.8116 1288.5556 1298.5128 1317.0844 1339.3427 1350.4966 1356.6344 1373.9715 1381.9819 1398.5237 1400.3664 1409.1713 1434.3360 1441.1720 1461.5790 1461.8580 1461.9576 1471.9396 1473.2711 1478.4647 1486.0551 1486.8488 1497.7473 1545.7813 1584.3989 1592.9060 1613.2973 1615.7410 1616.6842 1637.1690 2995.1499 2996.6468 3008.6896 3009.6688 3068.1125 3069.1435 3091.9967 3092.9778 3107.6436 3109.8356 3127.8545 3133.9489 3144.7080 3147.1318 3154.6064 3161.2080 3168.5316 3173.6500 3183.8291
redmass: 3.4392 5.5970 6.0101 4.6835 3.9579 5.2171 5.5415 6.1851 5.3372 3.2875 2.8168 5.0306 6.6055 4.6218 3.1360 5.3971 4.2083 3.8474 4.3602 5.0771 3.5052 3.4031 4.7363 5.7513 1.4166 2.3912 6.9368 7.6283 5.4510 8.3217 4.4529 3.9000 6.9173 5.4925 2.8643 6.8637 6.9439 8.7404 5.8330 4.6059 7.1995 7.5450 4.8017 8.6647 7.2853 6.8608 9.4119 7.4178 7.7065 7.2543 1.8551 8.2539 6.0291 3.5348 4.3015 4.0785 1.9800 2.1491 1.1170 1.1111 4.7141 4.2728 5.4145 1.2651 1.3949 1.4201 8.5905 1.4100 1.5935 6.1246 4.9123 4.8128 1.3294 1.5440 3.2145 7.4839 2.2907 2.5914 4.6180 3.4892 2.3446 1.8577 2.3778 2.2396 2.8006 5.4101 1.4635 1.4715 2.6149 1.0550 1.0694 1.1174 5.8589 1.1408 1.1370 3.2384 2.0076 3.0427 1.5248 3.2199 1.4699 1.6061 6.4604 9.7163 1.2741 1.3285 3.7396 2.3158 2.6098 1.2362 1.7274 1.2853 1.1251 1.1037 2.2855 1.0821 1.1534 3.1756 7.7530 6.0620 7.5465 6.5137 7.4445 9.2681 11.7982 1.0358 1.0360 1.0583 1.0580 1.1063 1.1068 1.0986 1.0985 1.1025 1.1024 1.0852 1.0880 1.0926 1.0867 1.0968 1.0910 1.1017 1.0955 1.0998
irintensity: 0.8816 0.9554 0.5252 1.7416 0.8438 0.8985 0.3232 0.5197 0.1344 0.6193 1.0592 0.8250 0.2812 1.0776 1.8365 0.2870 1.3701 1.0770 0.4533 3.8711 2.1223 2.8694 3.1876 3.8696 0.4972 1.8041 2.4297 9.6748 3.0489 5.6205 14.1310 3.5739 3.6282 3.1894 0.0231 2.8266 0.3686 4.2881 1.2726 6.8234 8.8460 4.0098 2.8469 4.5083 14.5106 5.1027 4.2249 3.1443 1.2961 1.3479 42.7257 10.9679 4.1049 19.7295 20.9081 12.5046 28.8626 74.4046 2.2220 3.2766 13.4861 0.0250 0.8859 0.4216 0.6169 3.3876 38.5393 10.2073 13.3838 181.0674 6.4768 88.8370 1.1508 18.8893 14.6766 201.2477 31.3549 59.4805 397.1574 68.8403 13.8567 18.0035 10.2001 4.3881 33.1347 186.3193 6.0801 6.5972 87.9053 0.4478 2.7184 0.3547 321.0930 1.1872 0.1333 157.4542 101.4955 70.0317 10.4583 67.2018 3.2843 7.2724 1.8492 12.3264 28.0099 42.0440 43.5863 7.0758 51.8331 15.3204 1.0922 12.0458 8.8151 3.2122 21.7034 3.6534 46.3650 72.9569 15.8313 5.6131 32.3399 47.6808 55.5176 72.7874 232.2766 20.8215 22.5640 19.6027 21.2818 6.1665 7.7911 31.4032 32.8107 35.3337 38.1489 1.6000 0.5219 13.6050 1.5136 24.8818 9.1863 20.1880 3.2019 8.7101
temp: 298.150 k
press: 1.00000 atm
elementType: 9 9 9 8 8 8 8 7 7 6 6 6 6 6 6 6 6 6 6 6 6 6 6 6 6 6 6 6 6 6 6 1 1 1 1 1 1 1 1 1 1 1 1 1 1 1 1 1 1 1
symmnumber: 1
zpe: 965059.0 jmol-1
zpe.correction: 0.367572 hartree
zpe.thermalcorrener: 0.396348 hartree
zpe.thermalcorrenthalpy: 0.397292 hartree
zpe.thermalcorrgfe: 0.304040 hartree
zpe.sumelectzpe: -1557.436600 hartree
zpe.sumelectthermal: -1557.407824 hartree
zpe.sumelectthermalent: -1557.406879 hartree
zpe.sumelectthermalfe: -1557.500132 hartree
dipole: -3.8224 -4.4655 -2.5828
dipole: 6.4205
quadrupole: -162.0538 -150.8035 -177.5042
quadrupole: 2.2161 11.8016 -0.5384
quadrupole: 1.4000 12.6503 -14.0504 2.2161 11.8016 -0.5384
hfenergy: -1557.8041714 hartree
pointgroup: C01 [X(C22H19F3N2O4)]
dipole: -2.2363736 -0.336971 1.1250665 debye
polarizability: 323.6382625|7.2569022|297.7802453|-16.0719041|19.4959447|199.6108877 unknown
InChI: InChI=1S/C22H19F3N2O4/c1-3-30-20(28)17-18(21(29)31-4-2)26-27(19(17)14-10-6-5-7-11-14)16-13-9-8-12-15(16)22(23,24)25/h5-13H,3-4H2,1-2H3
charge 0 multiplicity 1
50 atoms
F  -1.34164 -3.433383 -3.039536
F  -0.495435 -1.40864 -2.493177
F  0.702794 -3.299528 -2.097564
O  0.511476 3.354103 -0.360962
O  4.015036 -0.97954 0.178041
O  2.108896 3.017652 1.307185
O  3.854038 1.208753 -0.621952
N  -0.116748 -0.844632 0.230909
N  1.229039 -1.163391 0.049198
C  -0.335801 0.530151 0.397823
C  0.939308 1.121285 0.326009
C  -1.061951 -1.920205 0.353491
C  -1.669798 1.132062 0.590419
C  1.863903 0.043626 0.113865
C  -1.263048 -2.864397 -0.689971
C  -1.766818 -2.052614 1.569767
C  1.272229 2.559844 0.494105
C  -1.876577 2.08271 1.625192
C  -2.754148 0.790704 -0.261668
C  -2.151835 -3.945723 -0.479221
C  -0.594098 -2.74786 -2.039491
C  3.32021 0.175366 -0.150338
C  -2.662922 -3.122728 1.762825
C  -2.848117 -4.078649 0.739348
C  -3.14303 2.677208 1.806619
C  -4.019884 1.385499 -0.076362
C  -4.220402 2.328642 0.958706
C  0.754445 4.828253 -0.267283
C  5.481732 -0.956724 -0.122734
C  -0.199817 5.488941 -1.256112
C  6.038492 -2.300272 0.334294
H  -1.592708 -1.318806 2.361882
H  -1.046841 2.346185 2.291145
H  -2.596484 0.088261 -1.087244
H  -2.309699 -4.669204 -1.283662
H  -3.201342 -3.215528 2.711289
H  -3.53247 -4.920155 0.884287
H  -3.289838 3.406968 2.610321
H  -4.845659 1.121012 -0.745675
H  -5.204113 2.789575 1.100458
H  1.816786 5.01404 -0.50697
H  0.575598 5.14595 0.776378
H  5.931657 -0.10139 0.413041
H  5.607967 -0.789812 -1.207985
H  -0.065929 6.585909 -1.230025
H  -0.004122 5.138455 -2.283622
H  -1.249013 5.25809 -1.003587
H  7.12346 -2.345465 0.12763
H  5.883328 -2.442105 1.417353
H  5.545592 -3.130689 -0.198941
