program: Gaussian 09
title: 000178808
version: EM64L-G09RevD.01
frameworkgroup: C1[X(C14H7Cl3)]
method: RPBEPBE
basis: SDD
operation: Freq
keyword: #pfreq=noraman
keyword: PBEPBE/SDD
title: #p freq=noraman PBEPBE/SDD
converged: NO NO NO NO
title: Mulliken charges:
elementType: Cl Cl Cl C C C C C C C C C C C C C C H H H H H H H
charge: 0.004482 0.040537 0.001404 0.500802 0.473864 0.413748 0.404118 -0.605737 -0.673684 -0.309005 -0.469834 -0.418626 -0.416288 -0.114360 -0.112193 -0.236897 -0.235930 0.269551 0.254366 0.271123 0.247595 0.245002 0.233127 0.232836
chargesum: 0.00000
title: Mulliken charges with hydrogens summed into heavy atoms:
elementType: Cl Cl Cl C C C C C C C C C C C C C C
charge: 0.004482 0.040537 0.001404 0.500802 0.473864 0.413748 0.404118 -0.336186 -0.419318 -0.309005 -0.198711 -0.171032 -0.171286 -0.114360 -0.112193 -0.003770 -0.003094
polarizability: 3.57189047e+02 -4.93652017e+00 1.92754499e+02 -3.64924023e-03 5.98497125e-04 6.41927057e+01
1716.lowfreq: -0.0011 0.0005 0.0020 6.2869 6.4824 7.3657 57.6760 64.9385 88.0625
frequency: 57.6687 64.8718 88.0451 142.7041 170.5259 190.8053 206.1948 209.2010 282.7374 290.6894 313.8483 323.1070 334.9231 421.7084 442.2522 475.0150 491.5667 534.0580 538.9491 543.0647 578.4584 624.8633 641.0521 707.8426 731.0049 754.8306 764.0092 778.3911 787.7941 851.0530 860.7186 872.4310 911.5210 916.0186 936.0409 950.4391 973.2784 995.0300 1015.3441 1125.0505 1147.9058 1174.3960 1192.7858 1207.6387 1257.0295 1277.8207 1288.4986 1332.2077 1378.5682 1398.6007 1419.5453 1427.8998 1431.4354 1470.5565 1524.3590 1555.5236 1562.5767 1609.9481 1633.7302 3122.3762 3126.3971 3128.8325 3144.1990 3150.9039 3157.8011 3161.8182
redmass: 8.8642 7.6641 8.0185 8.7073 5.7304 24.1502 5.5598 32.4276 7.5351 12.1558 5.8473 4.6199 20.9124 4.1287 6.7186 2.5198 7.3618 3.6145 9.0124 4.2489 6.7006 6.9323 7.2387 8.3860 7.2530 1.6914 2.1973 6.5836 2.3437 1.2962 4.2330 1.5578 5.7016 1.4876 1.9926 8.8088 1.4039 1.3483 2.3070 1.9119 2.4234 1.0860 1.4240 1.7355 3.1414 2.3251 1.7087 2.2924 3.7802 3.2247 7.3313 3.1515 6.1345 2.8122 6.3557 6.7847 6.5487 6.8350 6.6095 1.0857 1.0914 1.0888 1.0956 1.0912 1.0925 1.1005
irintensity: 0.0721 0.0005 0.0668 0.2316 0.5886 0.0599 0.2666 0.0519 0.2475 3.1553 1.6301 0.4680 1.1328 0.0318 3.0039 21.5449 4.8393 1.4077 27.7806 0.8795 3.3113 0.0968 0.1178 11.4764 21.8681 45.7670 20.7454 35.2356 0.0219 0.0404 15.3839 0.3533 2.5748 73.3089 5.4446 3.1664 13.3247 0.0001 4.2743 18.9901 79.1204 0.9040 10.6788 3.7617 19.4711 14.4684 6.5381 5.3004 11.3930 53.8454 2.6305 20.3378 2.1189 2.9271 22.3200 5.8244 8.2877 14.4738 1.1466 0.4526 5.9205 0.8838 27.9658 0.8585 1.9735 39.9120
temp: 298.150 k
press: 1.00000 atm
elementType: 17 17 17 6 6 6 6 6 6 6 6 6 6 6 6 6 6 1 1 1 1 1 1 1
symmnumber: 1
zpe: 425753.7 jmol-1
zpe.correction: 0.162161 hartree
zpe.thermalcorrener: 0.175696 hartree
zpe.thermalcorrenthalpy: 0.176641 hartree
zpe.thermalcorrgfe: 0.121009 hartree
zpe.sumelectzpe: -1916.734318 hartree
zpe.sumelectthermal: -1916.720783 hartree
zpe.sumelectthermalent: -1916.719839 hartree
zpe.sumelectthermalfe: -1916.775470 hartree
dipole: -4.0961 -1.1827 0.0000
dipole: 4.2635
quadrupole: -110.4988 -108.6606 -123.2628
quadrupole: 0.3124 -0.0002 0.0003
quadrupole: 3.6419 5.4801 -9.1220 0.3124 -0.0002 0.0003
hfenergy: -1916.8964793 hartree
pointgroup: C01 [X(C14H7Cl3)]
dipole: -1.6096795 -0.4717085 0.0000022 debye
dipolederiv: -0.0787703 -0.0143035 -0.0000003 -0.1643539 -0.6939097 0.0000051 0.000008 0.000031 -0.0205367 -0.7478402 -0.1841919 0.0000456 -0.3587035 -0.0990487 0.0000232 0.0000862 0.0000207 0.0037464 -0.6936876 0.2864676 0.0000148 0.473106 -0.2918015 -0.0000121 0.0000618 -0.0000257 -0.0246148 0.0655485 -0.015024 -0.0000019 -0.1290758 -0.2929724 -0.0000004 -0.000012 0.0000162 0.0338524 0.1248313 -0.117537 0.0000019 0.0331138 -0.0156643 0.0000021 0.0000145 0.000001 0.0411502 0.1147384 -0.0486101 0.0000035 -0.0702116 -0.1000394 -0.0000051 -0.0000002 -0.0000039 0.0453879 0.1397566 0.0028778 0.000004 0.0495765 -0.109585 -0.0000033 -0.0000018 -0.0000033 0.0435222 -0.1000578 0.0207961 0.0000019 -0.0256806 0.064818 0.0000073 -0.0000121 -0.0000139 -0.1595493 -0.0999144 0.0518797 0.0000027 0.0352705 0.1303229 0.000011 -0.0000013 0.0000223 -0.178342 -0.03209 0.0134866 0.0000124 0.2370338 0.9744377 -0.0000112 0.0000296 -0.0000473 -0.0454953 -0.2296575 0.1593387 0.0000107 -0.0269859 -0.0791949 -0.0000025 0.0000257 -0.0000108 -0.1122701 -0.0704511 0.015055 0.0000016 -0.1226043 0.1078071 0.0000107 0.0000025 0.0000172 -0.1667121 -0.075083 0.0182881 0.0000014 0.1324759 0.1160266 0.0000006 0.0000072 -0.0000093 -0.1685428 0.7926763 0.489681 -0.0000784 0.5632459 -0.0794613 -0.0000387 -0.0001185 -0.0000207 -0.0392266 0.7428463 -0.6135017 -0.0000153 -0.6535975 0.4811155 0.0000297 -0.000077 0.0000365 -0.0573022 -0.0288292 -0.1485376 -0.0000026 -0.1053263 0.0540454 0.000005 -0.0000046 0.0000017 -0.1550223 0.0090152 0.1353935 0.000002 0.112802 0.0519317 0.0000034 -0.0000022 0.0000067 -0.1528151 0.086032 0.0074404 -0.0000003 0.01373 -0.015122 -0.0000028 0.0000017 0.0000067 0.1561658 0.0578641 -0.0062488 -0.0000009 -0.0087718 -0.076335 -0.0000064 -0.000004 -0.0000119 0.1526577 0.0669117 -0.0440248 -0.0000012 0.0208497 -0.0195718 -0.0000017 -0.0000057 -0.0000004 0.1646168 0.074918 -0.0506181 -0.0000027 0.0453341 -0.0855967 -0.0000071 0.0000008 -0.0000108 0.1575612 0.0720437 0.0345122 -0.0000002 -0.0627261 -0.0956495 -0.0000023 0.000001 0.0000029 0.1580226 -0.0855227 0.0959644 0.0000024 0.1049539 0.0273833 -0.0000022 0.000002 -0.0000036 0.1620663 -0.1052782 -0.0885837 -0.0000012 -0.0934548 0.0460636 -0.0000023 -0.0000015 -0.0000011 0.1616797 unknown
polarizability: 357.2257304|-4.2820422|192.7178158|-0.0036516|0.000584|64.1927057 unknown
InChI: InChI=1S/C14H7Cl3/c15-12-7-10-5-8-3-1-2-4-9(8)6-11(10)13(16)14(12)17/h1-7H
charge 0 multiplicity 1
24 atoms
Cl 1.929028 2.950243 -0.000028
Cl 4.602813 1.15583 -0.0002
Cl 4.376616 -2.067065 -0.000067
C  0.500988 0.538132 0.000044
C  0.430634 -0.922427 0.000017
C  -1.968423 0.648434 0.00004
C  -2.040872 -0.811152 0.000003
C  -0.701245 1.285211 0.000068
C  -0.836289 -1.55611 0.000004
C  1.810993 1.146339 0.000031
C  1.645074 -1.688037 0.00001
C  -3.195239 1.402996 0.000032
C  -3.335182 -1.443758 -0.000027
C  2.977872 0.378714 -0.000021
C  2.880019 -1.057914 0.000022
C  -4.429187 0.756874 0.000015
C  -4.499804 -0.679793 -0.000013
H  -0.654823 2.378952 0.000076
H  -0.881668 -2.652032 -0.000037
H  1.597254 -2.781389 -0.00001
H  -3.145904 2.498263 0.000066
H  -3.393085 -2.538672 -0.000033
H  -5.35419 1.34427 0.000028
H  -5.478081 -1.17351 -0.000019
