program: Gaussian 09
title: 000178797
version: EM64L-G09RevD.01
frameworkgroup: C1[X(C14H21NOS)]
method: RPBEPBE
basis: SDD
operation: Freq
keyword: #p
keyword: freq=noraman
keyword: PBEPBE/SDD
title: #p freq=noraman PBEPBE/SDD
converged: NO YES NO NO
title: Mulliken charges:
elementType: S O N C C C C C C C C C C C C C C H H H H H H H H H H H H H H H H H H H H H
charge: 0.084815 -0.232641 -0.329039 -0.380816 -0.349257 -0.557477 -0.417459 0.502283 -0.411518 -0.417074 -0.320914 -0.020476 -0.228399 -0.227685 -0.244012 -0.629295 -0.657353 0.220200 0.202164 0.233719 0.200567 0.209335 0.203450 0.254933 0.212955 0.320168 0.233053 0.230354 0.297525 0.223567 0.222903 0.208224 0.217074 0.248391 0.218461 0.236548 0.215563 0.227165
chargesum: 0.00000
title: Mulliken charges with hydrogens summed into heavy atoms:
elementType: S O N C C C C C C C C C C C C C C
charge: 0.084815 -0.232641 -0.008871 0.041549 0.085029 -0.144692 0.050428 0.502283 -0.178465 -0.186721 -0.023389 -0.020476 -0.004832 -0.004782 -0.016847 0.044394 0.013218
polarizability: 2.16604870e+02 -1.51115727e+01 1.82705164e+02 2.61635910e+01 4.06136945e+00 1.33760262e+02
1716.lowfreq: -23.9162 -8.9733 -4.9822 -3.8499 -0.0013 -0.0013 -0.0010 10.1326 13.8139
frequency: -21.1169 1.6249 13.6800 24.7563 43.3197 49.4559 67.3705 102.1805 113.5360 145.7093 188.9600 210.5956 228.7486 250.2747 254.5816 287.1379 304.9128 330.8230 336.0286 384.4281 399.8047 403.8502 450.6480 473.0047 511.8049 541.6032 577.5857 585.2834 617.7742 629.1140 705.7686 738.6818 751.2409 762.0847 803.9952 825.1144 854.3152 885.1372 896.4343 920.2286 923.5661 924.8256 948.4564 976.0148 989.7749 993.3512 1020.8636 1028.4351 1041.6070 1067.7004 1068.6255 1083.1402 1101.9906 1136.8341 1150.8959 1163.1425 1171.3247 1179.3392 1186.1758 1216.2094 1238.3234 1259.3266 1260.2601 1289.1347 1293.3496 1315.5984 1327.1016 1331.4956 1349.6374 1365.7838 1380.3904 1382.3400 1397.9170 1439.9378 1447.4022 1459.4010 1461.5350 1462.7768 1468.9652 1473.3493 1475.1873 1482.8082 1483.6708 1486.3289 1592.9264 1614.2206 1642.4503 2966.0917 2975.1098 2975.9698 2980.8077 2980.9429 3002.1715 3012.3942 3035.6085 3041.0237 3053.4158 3067.1748 3074.5816 3075.6679 3092.9013 3101.0816 3112.8459 3113.7628 3130.4611 3142.0156 3161.2430 3554.6880
redmass: 2.6526 4.1749 3.7833 5.2052 4.3754 7.6549 4.9219 2.7840 2.6714 2.8317 3.7216 1.0626 3.4229 1.1573 3.0325 3.2467 3.7121 2.7028 2.3046 2.8572 3.1966 2.8238 4.9011 2.9289 1.8903 1.7923 4.5629 3.9534 6.3536 6.8840 1.7614 1.7735 1.5119 2.1178 3.3198 1.7049 1.2513 2.6169 2.0564 2.0022 1.6162 1.1775 1.3851 1.3861 6.2874 1.3140 3.5987 2.3281 1.7942 2.1422 1.5134 2.6487 1.5446 2.3027 1.4177 1.9645 1.0516 2.4051 1.1169 2.3272 1.3467 1.2959 1.2596 1.1436 1.1999 1.3642 1.2532 1.3639 1.3868 1.3604 1.2219 7.7902 1.2098 2.1795 1.1412 1.0479 1.0838 1.0472 1.1410 1.4107 1.0674 1.0487 2.2751 1.1058 6.0538 6.1904 8.2198 1.0595 1.0613 1.0371 1.0536 1.0428 1.0639 1.0962 1.1008 1.0875 1.1029 1.0982 1.1034 1.0967 1.0999 1.1002 1.0871 1.0869 1.0906 1.0958 1.1014 1.0781
irintensity: 0.0307 0.0138 0.0242 0.2696 2.0031 10.0752 0.2058 0.2092 2.6284 1.6570 3.7260 0.1546 1.1274 0.2793 3.6416 2.0459 5.4083 1.9172 0.4027 10.0296 3.1577 0.0058 8.0584 14.3040 104.9584 47.0025 9.6459 13.1652 0.0754 1.5775 52.1487 3.7121 35.9975 56.6767 3.0031 23.0010 0.4417 5.0788 8.5196 13.6179 4.6505 7.2269 0.0552 0.0039 0.0555 0.1771 5.1910 11.1594 10.1574 21.0915 40.0063 6.6337 9.3290 3.3178 21.6241 93.4251 0.1632 168.6757 0.3652 0.1723 23.5184 5.4939 6.5992 2.6578 30.3679 3.8706 0.0169 4.4710 6.1354 7.2595 24.0748 0.0732 12.9739 6.8560 54.9486 7.7952 7.6992 1.7054 30.3576 186.0583 37.8950 17.6701 17.4225 16.0220 1.4042 11.2815 178.2482 4.7176 4.9264 22.6216 82.3128 43.8994 35.1249 2.7928 0.4631 2.4094 85.1454 3.0452 17.6317 56.5571 22.5363 24.4763 8.9407 9.3829 10.3405 46.5479 24.0741 28.2322
temp: 298.150 k
press: 1.00000 atm
elementType: 16 8 7 6 6 6 6 6 6 6 6 6 6 6 6 6 6 1 1 1 1 1 1 1 1 1 1 1 1 1 1 1 1 1 1 1 1 1
symmnumber: 1
zpe: 842622.3 jmol-1
zpe.correction: 0.320938 hartree
zpe.thermalcorrener: 0.339370 hartree
zpe.thermalcorrenthalpy: 0.340314 hartree
zpe.thermalcorrgfe: 0.268006 hartree
zpe.sumelectzpe: -1072.841931 hartree
zpe.sumelectthermal: -1072.823499 hartree
zpe.sumelectthermalent: -1072.822554 hartree
zpe.sumelectthermalfe: -1072.894863 hartree
dipole: -1.2571 0.0427 -1.0493
dipole: 1.6381
quadrupole: -109.6688 -103.8643 -113.2697
quadrupole: -8.6365 3.8535 -4.3620
quadrupole: -0.7345 5.0700 -4.3355 -8.6365 3.8535 -4.3620
hfenergy: -1073.1628686 hartree
pointgroup: C01 [X(C14H21N1O1S1)]
dipole: -0.4717677 -0.1178831 0.4229381 debye
polarizability: 207.826846|20.5446014|190.3844532|-28.0169557|-2.2563496|134.8589974 unknown
InChI: InChI=1S/C14H21NOS/c1-12(2)17-14(16)15-11-7-6-10-13-8-4-3-5-9-13/h3-5,8-9,12,15H,6-7,10-11H2,1-2H3
charge 0 multiplicity 1
38 atoms
S  3.366809 1.389695 1.031596
O  3.370987 -0.654649 -0.855495
N  1.889747 -0.884299 0.935885
C  -1.073033 -1.39475 0.083262
C  0.18162 -2.078759 -0.500486
C  -2.238499 -1.316847 -0.942451
C  1.353377 -2.191772 0.502424
C  -3.47407 -0.637057 -0.370451
C  -3.62301 0.772975 -0.435743
C  -4.484826 -1.391093 0.280421
C  4.567518 2.012814 -0.329599
C  2.859981 -0.227752 0.213483
C  -4.747089 1.41266 0.133773
C  -5.611234 -0.756916 0.852212
C  -5.746135 0.649095 0.78144
C  3.790167 2.758389 -1.42574
C  5.646272 2.86959 0.353238
H  -0.822691 -0.367918 0.416311
H  -1.419946 -1.945578 0.981817
H  0.533825 -1.529636 -1.394868
H  -0.077894 -3.103441 -0.837843
H  -1.881428 -0.769821 -1.837205
H  -2.487762 -2.344488 -1.273058
H  2.184286 -2.751375 0.038193
H  1.032147 -2.740358 1.408174
H  1.507743 -0.43517 1.769746
H  -2.854883 1.37145 -0.942092
H  -4.390601 -2.483387 0.332762
H  4.993387 1.079773 -0.738776
H  -4.846729 2.502324 0.068826
H  -6.384071 -1.356902 1.346486
H  4.490013 3.098705 -2.214181
H  3.27377 3.645175 -1.016203
H  3.042063 2.09779 -1.895238
H  5.208853 3.76367 0.834321
H  6.193542 2.29481 1.119962
H  6.3727 3.217266 -0.405606
H  -6.620407 1.142788 1.220504
