program: Gaussian 09
title: 000178852
version: EM64L-G09RevD.01
frameworkgroup: C1[X(C21H20N2O4)]
method: RPBEPBE
basis: SDD
operation: Freq
keyword: #p
keyword: freq=noraman
keyword: PBEPBE/SDD
title: #p freq=noraman PBEPBE/SDD
converged: YES YES NO NO
title: Mulliken charges:
elementType: O O O O N N C C C C C C C C C C C C C C C C C C C C C H H H H H H H H H H H H H H H H H H H H
charge: -0.256341 -0.248687 -0.256095 -0.242919 -0.348109 -0.022246 0.238460 -0.049809 0.447928 0.310500 -0.053825 -0.473215 -0.405023 0.477437 0.181639 -0.360124 -0.375620 -0.198773 -0.438481 0.185550 -0.237668 -0.242362 -0.813376 -0.238044 -0.215319 -0.677714 -0.499314 0.271529 0.280251 0.258209 0.289949 0.230498 0.235894 0.231029 0.233135 0.238363 0.235399 0.223662 0.231898 0.224754 0.235440 0.208007 0.239291 0.226667 0.242134 0.239534 0.235908
chargesum: 0.00000
title: Mulliken charges with hydrogens summed into heavy atoms:
elementType: O O O O N N C C C C C C C C C C C C C C C C C C C C C
charge: -0.256341 -0.248687 -0.256095 -0.242919 -0.348109 -0.022246 0.238460 -0.049809 0.447928 0.310500 -0.053825 -0.201686 -0.124772 0.477437 0.181639 -0.101915 -0.085672 0.031725 -0.202586 0.185550 -0.006640 -0.009226 -0.115953 -0.006146 0.244875 -0.003749 0.218262
polarizability: 3.47779632e+02 1.40897846e+01 2.84179043e+02 1.20363284e+01 -2.96081490e+01 1.69326681e+02
1716.lowfreq: -8.5083 -3.5334 -0.0004 0.0004 0.0007 4.3703 17.4178 29.9613 31.8567
frequency: 17.4172 29.9370 31.8419 40.9720 45.9292 51.4850 53.0804 58.3728 60.5270 73.7765 90.2715 108.5748 120.1948 134.6673 148.2855 185.5701 198.7185 210.7781 217.5772 233.6788 248.5141 250.1911 262.4949 274.5969 282.4511 340.1931 347.6642 368.2903 386.6325 406.9076 417.7389 441.6908 477.9145 508.5658 515.7698 543.3648 568.8988 613.3228 625.4929 635.6760 670.4411 681.2581 697.6639 701.0923 707.2472 738.7221 754.6309 767.1649 781.8234 792.0421 797.5284 801.4322 831.2254 853.9907 864.6832 890.9796 915.8590 919.4063 931.0825 965.2080 979.0128 983.8124 988.3817 989.7300 998.3032 999.6724 1019.4225 1026.7835 1040.7327 1050.1273 1079.2842 1087.7221 1096.4499 1112.3419 1113.6962 1130.7105 1134.5414 1147.1442 1150.5520 1174.9723 1180.6738 1200.2943 1200.8975 1227.7492 1250.5079 1297.0548 1309.6758 1325.7094 1346.9687 1355.8802 1373.0689 1382.8389 1397.5135 1398.8770 1399.4138 1417.3025 1434.1539 1436.6803 1452.5665 1457.0279 1462.0145 1462.6075 1471.0915 1471.6647 1476.1595 1478.5185 1486.1353 1488.1132 1540.6243 1581.4941 1599.1938 1613.7004 1614.7599 1618.3441 1627.9296 2979.3649 2995.1622 3002.7570 3011.3918 3059.5592 3071.4251 3088.3643 3091.8589 3103.5729 3108.7557 3127.9726 3129.5956 3138.5846 3150.3357 3151.0148 3151.2650 3153.8671 3163.7036 3178.7285 3181.3151
redmass: 3.7714 4.2474 3.6378 5.1209 4.6787 1.6296 1.8956 2.9984 4.7799 3.0346 4.1520 1.2729 3.9344 3.5207 4.4269 2.9502 4.5721 3.8857 3.8071 5.3107 2.6088 3.0251 3.3777 4.3591 5.0949 4.8918 5.8606 4.5234 4.3069 2.8614 5.5085 2.9522 4.7956 6.6855 5.0825 6.3146 5.0432 6.4994 6.7878 10.0722 7.0176 6.1071 2.2171 1.9349 8.0886 4.5149 5.1605 4.3990 4.1243 2.9515 1.5022 1.2940 4.3886 1.2515 5.0331 1.3318 2.3735 1.9101 1.6130 5.2776 1.4761 1.3587 4.4717 4.4747 1.5991 1.4750 2.6133 2.9556 3.8661 1.5601 2.2745 2.0619 1.6376 1.2675 2.2401 4.8873 1.4854 1.9345 2.5287 1.0560 1.1103 1.2357 3.0342 3.3472 1.1407 3.6967 1.3938 1.6706 3.8187 1.4753 5.7236 6.8555 1.5411 1.8175 1.4947 1.6151 2.3248 2.7071 1.0507 3.2650 1.0417 1.1193 1.1005 1.1238 1.5985 1.7386 1.1032 2.0422 7.3641 5.9452 6.1491 6.4205 9.3071 6.9220 10.5580 1.0376 1.0357 1.0297 1.0581 1.0971 1.1063 1.0992 1.0985 1.1044 1.1028 1.0851 1.0879 1.0890 1.1045 1.0942 1.0928 1.0937 1.0988 1.0974 1.0967
irintensity: 0.1686 0.4410 0.5775 1.1853 0.5573 0.6017 1.4948 0.2855 0.8322 1.2229 1.9024 1.2388 0.6614 0.7898 1.2916 1.2836 3.2453 5.3997 3.5555 1.9539 0.4209 1.2848 0.9846 4.3836 14.5360 5.9167 12.7226 5.0744 1.2569 0.1441 2.0923 3.6868 4.5160 0.4991 2.2883 7.4936 1.7337 0.1840 1.0224 3.9114 5.0304 2.6908 11.4809 53.0600 4.6838 66.5335 22.4000 0.5949 10.0479 14.6033 46.4265 5.1779 10.1274 2.0606 12.8008 7.9995 11.8653 9.0997 4.7210 21.8706 0.9060 0.5495 1.8513 2.3979 2.2590 0.2091 15.3100 52.4180 143.3408 12.0607 55.5803 125.0726 32.9992 0.4756 4.6741 86.4471 16.9423 96.8300 379.2000 0.5877 3.1433 8.2607 47.3616 39.5825 0.2725 90.4569 3.6142 7.2970 44.1981 2.9021 3.4931 3.9463 22.2215 63.3349 8.4936 18.8158 16.6430 18.1514 13.4779 102.7194 11.5312 5.1631 21.7586 11.9887 33.0057 32.8245 22.0482 62.9969 40.6439 8.2375 33.8961 9.4855 67.1966 68.9871 266.7789 28.6866 23.7243 43.4798 20.4292 15.8230 5.5669 19.4888 32.6743 25.5804 38.8024 0.0717 8.3645 7.1153 13.9862 27.9731 23.4427 9.2910 18.9067 8.2727 2.3038
temp: 298.150 k
press: 1.00000 atm
elementType: 8 8 8 8 7 7 6 6 6 6 6 6 6 6 6 6 6 6 6 6 6 6 6 6 6 6 6 1 1 1 1 1 1 1 1 1 1 1 1 1 1 1 1 1 1 1 1
symmnumber: 1
zpe: 956239.1 jmol-1
zpe.correction: 0.364212 hartree
zpe.thermalcorrener: 0.390264 hartree
zpe.thermalcorrenthalpy: 0.391209 hartree
zpe.thermalcorrgfe: 0.304505 hartree
zpe.sumelectzpe: -1220.704316 hartree
zpe.sumelectthermal: -1220.678264 hartree
zpe.sumelectthermalent: -1220.677320 hartree
zpe.sumelectthermalfe: -1220.764023 hartree
dipole: 2.5513 -0.0289 1.9023
dipole: 3.1826
quadrupole: -125.9083 -143.8479 -157.0455
quadrupole: 5.7734 -5.6049 -1.0821
quadrupole: 16.3589 -1.5806 -14.7783 5.7734 -5.6049 -1.0821
hfenergy: -1221.0685283 hartree
pointgroup: C01 [X(C21H20N2O4)]
dipole: 1.0495292 -0.0580422 0.68039 debye
polarizability: 350.5044335|-0.2261475|268.6116183|-8.0783935|-47.4244832|182.1693044 unknown
InChI: InChI=1S/C21H20N2O4/c1-4-27-20(24)17-18(21(25)26-3)22-23(16-12-8-9-14(2)13-16)19(17)15-10-6-5-7-11-15/h5-13H,4H2,1-3H3
charge 0 multiplicity 1
47 atoms
O  -2.938789 1.897988 0.403321
O  -3.117648 -2.280633 0.861322
O  -1.705153 2.666608 -1.41844
O  -3.835453 -0.702476 -0.698495
N  0.650655 -0.77077 0.137295
N  -0.489489 -1.55772 0.291979
C  0.350449 0.561942 -0.185158
C  -1.061065 0.62146 -0.249443
C  1.928996 -1.43162 0.236065
C  1.358721 1.643144 -0.249357
C  -1.526429 -0.700729 0.062179
C  2.981689 -1.094791 -0.64245
C  2.084489 -2.453015 1.201783
C  4.231294 -1.756025 -0.547692
C  -1.893012 1.818457 -0.508792
C  2.34163 1.771024 0.772341
C  1.340936 2.585147 -1.312607
C  3.323567 -3.118197 1.290981
C  4.391372 -2.768392 0.431926
C  -2.926748 -1.189806 0.016809
C  3.293188 2.80985 0.721558
C  2.29842 3.621813 -1.359397
C  5.359386 -1.394423 -1.498153
C  3.278768 3.737305 -0.347816
C  -3.965068 2.950973 0.131904
C  -5.078763 2.744074 1.152508
C  -4.474327 -2.876136 0.818325
H  2.833144 -0.323179 -1.404381
H  1.242605 -2.716038 1.847321
H  2.35076 1.066045 1.610417
H  0.569253 2.510201 -2.083396
H  3.458316 -3.910553 2.035073
H  5.35231 -3.289121 0.516448
H  4.039793 2.899745 1.518141
H  2.272562 4.341196 -2.184944
H  5.127847 -1.713611 -2.532132
H  5.528607 -0.302496 -1.525003
H  6.305539 -1.879432 -1.203376
H  4.018969 4.544336 -0.385932
H  -3.479144 3.939465 0.22253
H  -4.314233 2.82702 -0.908703
H  -5.871955 3.498772 1.000209
H  -5.523376 1.740813 1.039667
H  -4.69526 2.845265 2.18235
H  -4.703368 -3.233316 -0.199974
H  -5.229364 -2.129671 1.117901
H  -4.433521 -3.709895 1.532588
