program: Gaussian 09
title: 000178799
version: EM64L-G09RevD.01
frameworkgroup: C1[X(C14H21NOS)]
method: RPBEPBE
basis: SDD
operation: Freq
keyword: #p
keyword: freq=noraman
keyword: PBEPBE/SDD
title: #p freq=noraman PBEPBE/SDD
converged: YES YES NO NO
title: Mulliken charges:
elementType: S O N C C C C C C C C C C C C C C H H H H H H H H H H H H H H H H H H H H H
charge: 0.095151 -0.228694 -0.321281 -0.359660 -0.379708 -0.366818 -0.565325 -0.415192 0.504524 -0.412635 -0.415268 -0.228795 -0.228431 -0.026067 -0.244029 -0.598549 -0.616781 0.185192 0.203203 0.213958 0.208995 0.203790 0.233819 0.203220 0.205834 0.255889 0.213134 0.319768 0.231319 0.229949 0.223018 0.222569 0.226898 0.251401 0.295309 0.242032 0.222365 0.215896
chargesum: 0.00000
title: Mulliken charges with hydrogens summed into heavy atoms:
elementType: S O N C C C C C C C C C C C C C C
charge: 0.095151 -0.228694 -0.001513 0.028735 0.043245 0.070791 -0.156271 0.053831 0.504524 -0.181316 -0.185319 -0.005777 -0.005862 -0.026067 -0.017130 -0.051839 0.063513
polarizability: 2.17666625e+02 -1.77199489e+01 1.81588390e+02 1.40866275e+01 6.42759757e+00 1.31661793e+02
1716.lowfreq: -6.2622 -0.0023 -0.0011 0.0016 3.9348 5.0926 11.5696 16.1321 26.4349
frequency: 11.3499 15.6682 26.4222 32.5792 37.0314 53.9807 63.8331 78.0749 116.1955 128.7523 137.7266 186.9852 210.0405 246.0938 277.8555 296.6111 329.7275 334.1250 337.0818 395.2372 403.8362 434.5196 484.4923 511.9572 544.3171 583.4816 615.4323 617.8343 629.3417 705.4289 734.0020 746.2415 759.4573 760.5458 776.6387 807.4280 852.3165 864.0169 900.2907 916.0090 945.3083 975.2497 983.3979 989.8480 992.6704 1011.2474 1026.4586 1048.3610 1054.8349 1061.3958 1070.5066 1075.7877 1090.4023 1105.8134 1145.5589 1171.4370 1179.5376 1186.1396 1215.6394 1228.6274 1239.4326 1256.8799 1276.8935 1286.4517 1286.9852 1290.7237 1312.9368 1327.3396 1342.9794 1351.7908 1367.6137 1382.3744 1391.9492 1437.2756 1440.2559 1453.3212 1459.6364 1465.4679 1465.5440 1474.6897 1477.7324 1478.8421 1483.4828 1488.2399 1593.0013 1614.2783 1653.2177 2950.2826 2969.3787 2977.3321 2979.9570 2981.2256 2996.7979 3002.0086 3018.5446 3028.4028 3042.1172 3052.4781 3074.7803 3077.0644 3088.7794 3112.3818 3113.3779 3115.3209 3130.3894 3141.6608 3161.2006 3554.1039
redmass: 4.6171 3.7494 4.2961 2.7864 4.8486 5.4574 4.6014 2.7898 1.9498 3.8109 2.5414 1.8519 3.7728 1.6643 2.6788 3.7714 3.1001 2.9639 2.3458 3.3994 2.8193 9.1164 2.1643 2.6573 1.6309 3.8489 5.2952 6.3561 6.5411 1.7281 1.2341 2.1949 1.9823 1.1905 1.3641 3.8349 1.2647 1.6727 2.7578 1.4815 1.6258 1.3871 1.7490 6.2987 1.3276 4.0703 2.2244 1.9864 2.0383 1.5037 2.2256 2.4479 2.6022 1.4411 1.5092 1.0519 2.5738 1.1143 2.3140 1.3302 1.3579 1.1924 1.2583 1.1971 1.2185 1.0740 1.2830 1.2505 1.4198 1.4431 1.3673 7.8304 1.2090 1.0936 2.1791 1.1391 1.0823 1.0846 1.0403 1.1372 1.0467 1.4558 2.2520 1.1069 6.0464 6.1846 8.0468 1.0593 1.0589 1.0607 1.0614 1.0372 1.0924 1.0666 1.1007 1.0595 1.1021 1.1028 1.0960 1.1024 1.1022 1.0872 1.0868 1.1054 1.0906 1.0958 1.1014 1.0779
irintensity: 0.3519 0.0290 0.1398 0.9978 0.0822 9.6600 1.9031 0.2128 0.0129 0.2298 0.7963 4.5729 4.0103 0.5815 2.5074 10.6956 3.3984 1.1876 0.2620 16.7541 0.0013 2.9720 31.1110 40.8961 98.2382 7.6536 10.5378 0.0787 2.1036 51.8316 5.5513 43.2398 42.1507 2.8075 17.8656 3.4205 1.2654 22.2223 5.5672 1.9489 17.0169 0.0729 30.5605 0.0354 0.1823 0.6561 7.9177 0.7629 8.9088 0.3731 5.6284 8.5638 8.3012 8.3016 11.1436 0.0445 235.9405 0.8143 0.2677 22.0886 4.6839 4.6536 22.2333 9.2988 1.2663 1.3497 13.9892 0.0411 4.4793 1.2548 6.5554 0.0925 14.7403 19.0571 6.4348 52.9869 5.5904 5.0876 15.9949 20.6153 6.7568 213.4169 18.1296 17.6468 1.4008 11.6445 180.1131 22.3735 0.3725 6.4704 93.1388 33.2902 19.7902 27.4508 0.3355 20.7203 0.5116 118.2115 35.9344 16.1281 8.6974 9.1281 10.2363 17.4397 9.9498 47.3453 24.9225 26.8522
temp: 298.150 k
press: 1.00000 atm
elementType: 16 8 7 6 6 6 6 6 6 6 6 6 6 6 6 6 6 1 1 1 1 1 1 1 1 1 1 1 1 1 1 1 1 1 1 1 1 1
symmnumber: 1
zpe: 844492.4 jmol-1
zpe.correction: 0.321650 hartree
zpe.thermalcorrener: 0.340839 hartree
zpe.thermalcorrenthalpy: 0.341784 hartree
zpe.thermalcorrgfe: 0.268312 hartree
zpe.sumelectzpe: -1072.839238 hartree
zpe.sumelectthermal: -1072.820049 hartree
zpe.sumelectthermalent: -1072.819105 hartree
zpe.sumelectthermalfe: -1072.892576 hartree
dipole: 1.3012 -0.7909 -1.2591
dipole: 1.9759
quadrupole: -116.2415 -98.9354 -117.3330
quadrupole: -6.1160 6.0162 4.0158
quadrupole: -5.4049 11.9012 -6.4963 -6.1160 6.0162 4.0158
hfenergy: -1073.1608884 hartree
pointgroup: C01 [X(C14H21N1O1S1)]
dipole: -0.5303404 0.3004294 -0.4824804 debye
polarizability: 217.7824967|-16.9706844|180.8155659|-15.9669067|-6.2366068|132.3187454 unknown
InChI: InChI=1S/C14H21NOS/c1-2-17-14(16)15-12-8-4-7-11-13-9-5-3-6-10-13/h3,5-6,9-10,15H,2,4,7-8,11-12H2,1H3
charge 0 multiplicity 1
38 atoms
S  5.116011 -0.346663 -1.300735
O  4.437812 0.59392 1.23074
N  3.281854 1.517345 -0.578978
C  0.178872 1.369926 -0.428614
C  -1.151931 0.779573 0.088218
C  1.124354 1.798757 0.714431
C  -2.095351 0.318144 -1.057536
C  2.448726 2.433517 0.228684
C  -3.403797 -0.258459 -0.536521
C  -3.515407 -1.637399 -0.219722
C  -4.52893 0.576676 -0.311168
C  -4.713844 -2.167682 0.309239
C  -5.730158 0.052241 0.217588
C  4.202634 0.674539 -0.002407
C  -5.826757 -1.323457 0.531039
C  6.090249 -1.457544 -0.113072
C  5.35528 -2.764641 0.20982
H  -0.036963 2.244016 -1.080166
H  0.685773 0.615958 -1.065598
H  -0.942806 -0.08245 0.75315
H  -1.678575 1.531266 0.710183
H  0.610654 2.539154 1.361145
H  1.363035 0.928424 1.355444
H  -2.297766 1.183304 -1.719821
H  -1.56346 -0.437289 -1.669241
H  3.052578 2.745255 1.098557
H  2.241994 3.330564 -0.385824
H  3.135858 1.467966 -1.588554
H  -2.657877 -2.299857 -0.394199
H  -4.463642 1.644296 -0.557565
H  -4.781734 -3.236202 0.544156
H  -6.589754 0.712608 0.38067
H  -6.757992 -1.732966 0.938473
H  7.058392 -1.626577 -0.612286
H  6.24129 -0.845094 0.792384
H  4.398385 -2.556761 0.718442
H  5.146206 -3.350954 -0.702012
H  5.973588 -3.386953 0.88566
