program: Gaussian 09
title: 000178798
version: EM64L-G09RevD.01
frameworkgroup: C1[X(C17H25NOS)]
method: RPBEPBE
basis: SDD
operation: Freq
keyword: #p
keyword: freq=noraman
keyword: PBEPBE/SDD
title: #p freq=noraman PBEPBE/SDD
converged: YES YES NO NO
title: Mulliken charges:
elementType: S O N C C C C C C C C C C C C C C C C C H H H H H H H H H H H H H H H H H H H H H H H H H
charge: 0.054291 -0.234623 -0.328304 -0.417992 -0.378640 -0.381701 -0.388930 -0.389746 -0.384734 -0.002367 -0.349925 -0.417344 -0.381486 -0.558069 0.502388 -0.421099 -0.407512 -0.226818 -0.229643 -0.244088 0.329213 0.197867 0.227153 0.225465 0.198165 0.210312 0.199653 0.199713 0.209619 0.202988 0.188201 0.232148 0.201280 0.221133 0.202711 0.255574 0.213538 0.320763 0.203710 0.209686 0.230498 0.233309 0.222916 0.223627 0.227100
chargesum: 0.00000
title: Mulliken charges with hydrogens summed into heavy atoms:
elementType: S O N C C C C C C C C C C C C C C C C C
charge: 0.054291 -0.234623 -0.007541 -0.088779 0.046380 0.041929 0.021035 0.019586 0.006455 -0.002367 0.083502 0.051769 0.042357 -0.144673 0.502388 -0.190601 -0.174202 -0.003902 -0.006016 -0.016988
polarizability: 2.55161354e+02 -1.47124848e+01 2.14873384e+02 -2.61681509e+01 -5.36335967e+00 1.54450930e+02
1716.lowfreq: -15.8127 -11.4775 0.0018 0.0018 0.0020 3.4295 7.4703 11.3693 14.8048
frequency: -13.4670 3.4627 11.2289 23.9134 38.9458 55.5717 63.2169 88.6002 94.1863 126.5713 149.1414 182.8216 193.9465 225.8490 251.6528 282.6404 306.2571 330.1547 333.2511 363.9941 398.7159 402.6948 432.8116 438.0943 464.8387 473.0347 514.7710 533.5596 548.3190 577.5549 617.9117 628.1463 674.8929 705.1320 739.0646 752.4755 762.1442 780.8541 801.8612 803.7494 823.7657 851.0222 853.2154 865.9623 874.2203 897.0160 919.7637 923.8036 923.9164 975.1225 989.6760 993.2013 1004.0033 1022.2649 1028.7759 1041.4462 1050.3517 1051.2081 1069.8305 1086.7723 1090.7139 1102.6439 1106.4360 1115.4785 1152.1067 1154.5125 1171.4088 1181.1280 1185.8495 1216.6137 1220.9680 1237.2318 1259.0318 1261.0704 1265.3629 1269.6512 1286.9860 1291.8521 1306.4945 1326.6522 1329.5237 1330.5944 1339.0292 1342.3812 1348.0544 1354.2204 1357.8674 1364.4460 1382.3090 1440.0979 1448.7108 1449.9192 1456.8487 1461.0059 1465.5528 1467.7820 1468.7608 1476.6360 1480.3643 1483.4240 1485.1949 1592.7306 1614.3517 1647.6138 2959.4427 2963.6100 2963.9544 2964.6320 2972.3267 2972.8284 2974.6699 2980.0575 3001.6933 3011.4957 3016.0689 3027.2713 3031.8653 3034.4810 3040.2745 3047.4004 3051.8814 3052.5413 3075.3353 3112.7783 3113.2389 3130.0742 3141.8484 3160.8898 3553.5981
redmass: 3.6301 3.7206 4.9632 4.9991 4.0408 7.8699 4.8239 2.5242 3.3908 2.6289 4.2950 2.7499 4.2704 3.1284 3.3634 2.9510 3.0431 2.1078 2.3468 2.2038 2.6217 2.8170 9.1557 3.2251 2.5305 2.5138 2.0935 2.7692 1.6836 4.5126 6.3528 6.6356 2.6878 1.7577 1.7246 1.5380 2.1185 1.4719 3.3331 3.4444 1.7327 1.4131 1.2524 2.5173 2.5502 2.0003 2.1060 1.5894 1.3715 1.3876 6.2886 1.3134 2.5702 3.3380 2.4910 1.8214 1.6761 1.5161 2.4201 2.5948 1.5733 1.5525 1.7830 1.0751 1.4016 1.7103 1.0520 2.5508 1.1198 2.4052 1.2694 1.3303 1.2979 1.2353 1.2552 1.2542 1.1339 1.2110 1.6332 1.2546 1.3136 1.3654 1.4580 1.5120 1.3917 1.4398 1.4113 1.3675 7.7584 2.1766 1.0851 1.1342 1.0871 1.0812 1.0856 1.1089 1.0819 1.1793 1.3326 2.2620 1.1337 6.0411 6.2014 8.1087 1.0663 1.0630 1.0661 1.0595 1.0630 1.0608 1.0607 1.0602 1.0649 1.0958 1.0865 1.0960 1.1000 1.1009 1.1009 1.0964 1.0979 1.1029 1.1032 1.0872 1.0869 1.0906 1.0958 1.1015 1.0780
irintensity: 0.1405 0.1345 0.0748 0.0354 0.3982 9.9579 0.1181 1.1675 1.0747 0.0774 2.2951 0.8304 3.8657 1.5366 2.2537 6.9897 1.2054 0.5042 0.4882 11.8314 5.4093 0.0134 1.4445 1.4925 2.6303 13.3566 84.1028 22.7517 59.1869 11.4892 0.0872 0.6848 18.6189 52.2690 3.8087 40.0898 57.5092 0.2648 9.3968 1.7161 28.2788 20.8009 0.1196 5.5696 5.4254 7.3321 16.5670 6.9066 5.5396 0.0075 0.0832 0.1796 17.2518 4.6808 10.9642 11.3421 1.6340 0.7540 5.8325 12.5819 0.1187 7.8650 27.0506 0.3757 17.8918 1.5056 0.2781 268.7680 1.6929 0.1263 3.3729 28.3106 3.8440 1.5946 5.4246 10.9053 0.9316 34.9407 0.0026 0.0052 0.0337 4.8266 0.2974 2.9141 5.7088 0.6013 0.9306 7.5748 0.0850 6.7464 10.0763 55.9816 6.6023 6.1393 9.2931 7.6867 17.7006 114.4998 151.7183 16.3823 27.3272 1.3770 11.0585 172.2913 12.1230 25.6859 60.0287 4.6758 22.1997 29.6735 4.1053 85.2784 35.2170 3.0283 11.2995 81.1832 59.1787 0.7166 68.5588 29.0769 69.2161 70.7486 17.6695 8.3989 9.9373 10.5550 46.5988 23.9236 26.8063
temp: 298.150 k
press: 1.00000 atm
elementType: 16 8 7 6 6 6 6 6 6 6 6 6 6 6 6 6 6 6 6 6 1 1 1 1 1 1 1 1 1 1 1 1 1 1 1 1 1 1 1 1 1 1 1 1 1
symmnumber: 1
zpe: 1014225.4 jmol-1
zpe.correction: 0.386298 hartree
zpe.thermalcorrener: 0.406206 hartree
zpe.thermalcorrenthalpy: 0.407150 hartree
zpe.thermalcorrgfe: 0.332030 hartree
zpe.sumelectzpe: -1189.338715 hartree
zpe.sumelectthermal: -1189.318807 hartree
zpe.sumelectthermalent: -1189.317863 hartree
zpe.sumelectthermalfe: -1189.392983 hartree
dipole: 1.0361 0.2026 -1.2611
dipole: 1.6446
quadrupole: -121.8951 -124.9369 -130.2586
quadrupole: -8.8955 -5.4646 4.9257
quadrupole: 3.8018 0.7599 -4.5617 -8.8955 -5.4646 4.9257
hfenergy: -1189.7250132 hartree
pointgroup: C01 [X(C17H25N1O1S1)]
dipole: 0.4039591 -0.0293248 -0.5046104 debye
polarizability: 240.9476875|-22.3410985|227.6162869|-29.0705579|7.9995853|155.921694 unknown
InChI: InChI=1S/C17H25NOS/c19-17(20-16-12-5-2-6-13-16)18-14-8-7-11-15-9-3-1-4-10-15/h1,3-4,9-10,16,18H,2,5-8,11-14H2
charge 0 multiplicity 1
45 atoms
S  -2.336152 0.884489 -0.641436
O  -2.435815 -1.473265 0.848276
N  -0.936886 -1.415045 -0.941648
C  -3.711595 1.219925 0.660543
C  -5.070538 1.412007 -0.045467
C  -3.331645 2.446047 1.516968
C  -5.133963 2.732161 -0.849395
C  -3.389721 3.765701 0.711282
C  -4.769802 3.950667 0.033866
C  -1.90116 -0.875634 -0.1225
C  0.800139 -2.797905 0.270979
C  -0.3909 -2.769846 -0.715904
C  2.025549 -1.995842 -0.215633
C  3.216463 -2.058888 0.781037
C  4.416414 -1.254986 0.30154
C  5.457526 -1.870296 -0.440697
C  4.49768 0.141124 0.545299
C  6.547731 -1.114364 -0.929094
C  5.584987 0.901834 0.059977
C  6.614716 0.27624 -0.681262
H  -3.697291 0.288775 1.258023
H  -5.852497 1.428568 0.744178
H  -5.28468 0.544291 -0.695391
H  -2.331247 2.300596 1.963499
H  -4.058751 2.501098 2.355614
H  -4.426578 2.668376 -1.701529
H  -6.145043 2.860214 -1.281806
H  -3.17045 4.622742 1.376884
H  -2.596062 3.749996 -0.063702
H  -4.776097 4.87678 -0.573105
H  -5.545262 4.07661 0.818486
H  0.457603 -2.412354 1.250815
H  1.08735 -3.857946 0.42859
H  1.74341 -0.934837 -0.36549
H  2.361146 -2.378369 -1.201798
H  -1.211994 -3.395654 -0.324932
H  -0.084406 -3.177117 -1.698077
H  -0.559038 -0.841011 -1.69719
H  3.501854 -3.11924 0.927378
H  2.870299 -1.681297 1.763533
H  5.415203 -2.95025 -0.631882
H  3.705359 0.632672 1.124355
H  7.344677 -1.608559 -1.496764
H  5.632378 1.978074 0.262344
H  7.46029 0.863819 -1.056266
