program: Gaussian 09
title: 000178766
version: EM64L-G09RevD.01
frameworkgroup: C1[X(C4H2Cl4)]
method: RPBEPBE
basis: SDD
operation: Freq
keyword: #pfreq=noraman
keyword: PBEPBE/SDD
title: #p freq=noraman PBEPBE/SDD
converged: NO NO NO NO
title: Mulliken charges:
elementType: Cl Cl Cl Cl C C C C H H
charge: -0.018362 0.087910 0.045253 -0.008857 0.201789 -0.011757 -0.414418 -0.431116 0.267756 0.281803
chargesum: 0.00000
title: Mulliken charges with hydrogens summed into heavy atoms:
elementType: Cl Cl Cl Cl C C C C
charge: -0.018362 0.087910 0.045253 -0.008857 0.201789 0.255999 -0.414418 -0.149313
polarizability: 1.50118485e+02 2.30547988e+00 9.00613861e+01 -3.42584917e-03 -4.62054317e-03 2.79673589e+01
1716.lowfreq: -0.0044 -0.0035 -0.0030 3.8454 7.3666 14.1749 66.4977 95.7893 129.8509
frequency: 66.4714 95.7893 129.8387 160.1862 192.5414 233.4472 272.6482 331.7634 357.7527 364.2286 531.4263 567.0346 698.8485 798.1300 818.0239 856.7608 928.4685 1166.9922 1216.4094 1281.8896 1563.1546 1620.7716 3151.0332 3203.7806
redmass: 30.3070 23.0193 2.4933 6.2624 24.4096 23.7121 15.5309 8.1636 18.7787 9.9040 7.1531 10.1671 7.7690 1.8314 6.9490 10.7243 1.1165 7.0922 1.1291 1.2222 10.3600 7.2933 1.0908 1.0946
irintensity: 0.0010 0.7595 0.0825 0.3315 0.2857 0.0139 0.2831 2.0619 0.3751 1.7007 0.6438 58.2425 67.5444 11.0524 121.9773 43.4631 80.7215 11.2145 9.5126 4.5066 74.5686 21.5095 3.3916 7.4301
temp: 298.150 k
press: 1.00000 atm
elementType: 17 17 17 17 6 6 6 6 1 1
symmnumber: 1
zpe: 123259.6 jmol-1
zpe.correction: 0.046947 hartree
zpe.thermalcorrener: 0.056059 hartree
zpe.thermalcorrenthalpy: 0.057003 hartree
zpe.thermalcorrgfe: 0.010562 hartree
zpe.sumelectzpe: -1993.211443 hartree
zpe.sumelectthermal: -1993.202331 hartree
zpe.sumelectthermalent: -1993.201387 hartree
zpe.sumelectthermalfe: -1993.247828 hartree
dipole: -0.0961 0.0046 0.0000
dipole: 0.0962
quadrupole: -77.0843 -71.2873 -75.2374
quadrupole: 1.2713 0.0001 -0.0003
quadrupole: -2.5479 3.2491 -0.7011 1.2713 0.0001 -0.0003
hfenergy: -1993.2583902 hartree
pointgroup: C01 [X(C4H2Cl4)]
dipole: -0.0377388 0.0026878 -0.0000158 debye
dipolederiv: -0.1397151 -0.0193948 0.0000051 0.0016565 -0.5870137 0.0000394 0.0000049 0.0000463 -0.0214162 -0.7554816 0.1935258 0.000008 0.3380539 -0.2190518 0.0000079 -0.000018 0.000013 0.0602552 -0.1291521 0.0050821 0.0000034 -0.1386717 -0.7485467 0.0000518 0.0000006 0.0000361 0.0375256 -0.8683799 0.0954971 0.0000095 0.4617572 -0.1767226 -0.0000015 -0.0000592 0.0000121 -0.0384356 0.0506209 -0.0490107 0.0000003 -0.076292 0.6671787 -0.0000469 -0.0000216 -0.0000604 0.0072133 -0.2873261 0.0785968 -0.0000117 -0.1254914 -0.2313915 0.0000104 -0.0000046 0.0000053 -0.0825239 0.9372898 -0.1352007 -0.000017 -0.1133055 1.0210207 -0.0000671 0.0000262 -0.0000521 -0.164146 1.0908417 -0.2486699 0.0000021 -0.4558243 0.2595044 -0.0000169 0.0000985 -0.0000172 -0.2223663 0.0801448 0.0074019 0.0000055 0.0395313 0.0060363 0.0000145 0.0000011 0.0000153 0.188862 0.0211577 0.0721724 -0.0000052 0.0685859 0.0089862 0.0000083 -0.000028 0.0000016 0.2350319 unknown
polarizability: 150.1927495|0.9217562|89.987122|-0.0035312|-0.0045405|27.9673589 unknown
InChI: InChI=1S/C4H2Cl4/c5-2-1-3(6)4(7)8/h1-2H
charge 0 multiplicity 1
10 atoms
Cl 0.323241 -2.15399 0.000204
Cl 3.110077 -0.487294 0.000011
Cl 1.602662 2.125531 -0.000113
Cl -3.749487 0.544198 0.000108
C  0.31051 -0.331797 0.000065
C  -0.992708 0.3197 0.000074
C  1.512944 0.322961 -0.000018
C  -2.180636 -0.342312 0.000178
H  -0.979791 1.415034 -0.000019
H  -2.297611 -1.427332 0.000211
