program: Gaussian 09
title: 000178853
version: EM64L-G09RevD.01
frameworkgroup: C1[X(C21H20N2O4)]
method: RPBEPBE
basis: SDD
operation: Freq
keyword: #p
keyword: freq=noraman
keyword: PBEPBE/SDD
title: #p freq=noraman PBEPBE/SDD
converged: YES YES NO NO
title: Mulliken charges:
elementType: O O O O N N C C C C C C C C C C C C C C C C C C C C C H H H H H H H H H H H H H H H H H H H H
charge: -0.272704 -0.249670 -0.222124 -0.237670 -0.334108 -0.022789 0.253400 -0.049993 0.432267 0.300507 -0.067032 -0.331450 -0.387300 0.163821 -0.373726 -0.357603 0.448062 -0.409897 -0.349825 0.186120 -0.240153 -0.231926 -0.239092 -0.806316 -0.214250 -0.680178 -0.500090 0.266940 0.278696 0.274680 0.256039 0.235482 0.234987 0.230356 0.231889 0.232344 0.229326 0.226078 0.237833 0.228051 0.239962 0.213955 0.233584 0.223087 0.245787 0.240196 0.234447
chargesum: 0.00000
title: Mulliken charges with hydrogens summed into heavy atoms:
elementType: O O O O N N C C C C C C C C C C C C C C C C C C C C C
charge: -0.272704 -0.249670 -0.222124 -0.237670 -0.334108 -0.022789 0.253400 -0.049993 0.432267 0.300507 -0.067032 -0.064510 -0.108604 0.163821 -0.099045 -0.101564 0.448062 -0.174415 -0.114838 0.186120 -0.009797 -0.000037 -0.006749 -0.113079 0.253764 -0.009552 0.220339
polarizability: 3.40360943e+02 -7.38035948e+00 3.02356716e+02 1.08866121e+01 1.78138319e+01 1.61644731e+02
1716.lowfreq: -36.6359 -5.4757 -3.0915 0.0003 0.0006 0.0007 2.5330 12.9002 25.7910
frequency: -36.5601 12.4959 25.7836 35.0117 40.6802 46.3538 51.9414 60.0714 63.7307 76.2152 92.7123 106.5935 112.4419 118.6229 141.3529 162.9663 188.1671 200.7326 226.5326 233.4537 243.4374 259.9737 267.0663 285.2466 303.9183 327.1935 360.1937 366.1654 397.2111 404.9751 411.2341 441.0366 471.9114 484.2933 524.1398 528.1098 608.6052 613.6563 621.9008 634.2752 656.0067 672.9753 701.7395 706.7755 714.4868 737.2057 757.5867 768.6855 784.0018 788.4594 800.7190 815.8310 826.2050 831.7990 841.6238 855.3031 913.9613 931.2511 953.7012 958.9481 973.5280 980.3999 987.0188 989.7645 999.1181 1010.0330 1014.2243 1025.9605 1033.3654 1047.5833 1068.9567 1085.0835 1111.7665 1112.9010 1117.7477 1129.8441 1134.4119 1147.8088 1149.3629 1174.5947 1193.0252 1195.6841 1213.9783 1223.7683 1248.7769 1292.9096 1313.0656 1320.5500 1345.3797 1354.5669 1372.2006 1375.7343 1398.5914 1399.6213 1400.2100 1414.5317 1420.2462 1434.7464 1452.0245 1460.4587 1463.8222 1464.2695 1470.1890 1472.0127 1475.2063 1478.2941 1486.4307 1509.4501 1537.2731 1583.2902 1591.4924 1614.7264 1620.8800 1622.7742 1639.6066 2977.6296 2993.6813 3003.3225 3012.7954 3056.8711 3071.0154 3087.1437 3090.1750 3104.4760 3105.3155 3127.6740 3130.0623 3133.8513 3136.5536 3149.1977 3150.1413 3163.5529 3170.5412 3176.4364 3177.2726
redmass: 1.0175 4.6149 5.0765 4.1209 4.4921 4.3017 4.1524 4.6391 2.7470 3.0819 1.3263 3.9925 4.5146 3.4321 4.5609 3.3010 4.5875 4.6123 3.9667 4.4821 6.4627 1.6868 4.2796 4.1632 4.9738 4.8572 3.4965 4.4863 4.6745 2.8387 3.0315 7.3101 5.4564 5.3190 5.5347 3.3974 6.7890 6.4690 6.8157 7.2576 7.8522 6.8535 1.9448 6.8253 3.4725 4.1295 4.6829 5.4351 3.0884 5.8375 1.1372 6.1039 1.7098 2.9739 1.2724 1.2480 7.1101 1.4726 1.3367 7.2580 1.3911 1.4188 1.4225 5.5998 1.3237 3.2784 3.2684 3.1003 2.7359 1.5574 3.7890 1.8226 2.3493 1.2654 2.2048 2.6647 1.4957 2.5012 1.6708 1.0544 1.1188 1.1255 7.2531 2.8780 1.1370 4.2649 1.3402 1.5691 4.6481 1.4396 6.2970 6.0281 1.4762 1.8101 1.6118 2.3600 1.7465 2.3156 1.0501 1.7204 1.5828 1.0533 1.0587 1.1355 1.1342 2.1788 1.1447 2.9362 7.3056 5.9439 6.7445 6.1569 10.7978 6.4416 11.5595 1.0380 1.0358 1.0296 1.0583 1.0965 1.1059 1.0991 1.0987 1.1044 1.1030 1.0851 1.0902 1.0898 1.0888 1.0944 1.1046 1.0987 1.0950 1.0954 1.0973
irintensity: 0.3729 1.8773 0.3481 0.1971 2.2590 0.7748 0.0656 1.0811 0.5014 0.1216 0.4422 0.8700 0.0654 0.6237 1.4463 2.7254 4.5446 0.6960 1.1041 0.4490 2.6774 2.4341 13.9414 3.1421 2.2272 10.6907 4.9469 8.7789 8.4976 0.0318 1.1352 0.1524 0.2029 2.6759 10.2978 16.5062 4.6105 0.2043 6.1389 0.6637 2.2255 2.8992 46.0558 3.3366 0.2513 44.2407 17.0083 2.7411 27.0839 2.5159 2.3090 11.5132 43.9421 9.5527 3.2099 1.0862 22.9888 5.1710 4.4829 14.6594 0.4544 2.0559 3.4439 0.9712 0.8666 16.7174 71.5335 159.5723 185.5629 15.2608 60.1437 17.0000 7.4689 0.6917 21.3077 135.5209 2.0383 39.2614 100.2080 0.0795 5.6083 0.8447 236.2952 2.2731 0.9024 123.1485 4.6891 10.0183 58.1983 1.8057 4.7294 4.0824 17.9034 62.2512 10.2074 2.3832 32.4311 10.8729 14.3561 23.9798 8.6024 12.9384 10.8769 14.1564 17.1782 29.6494 25.7986 108.5194 18.6027 0.1527 1.3037 6.6738 125.0489 4.1532 316.4341 38.5174 20.7028 43.2624 17.9638 18.9992 2.9938 17.0913 36.6970 24.1325 42.7935 0.8975 17.3551 18.7873 5.8993 26.7649 15.5426 21.5822 5.6577 0.1182 5.8357
temp: 298.150 k
press: 1.00000 atm
elementType: 8 8 8 8 7 7 6 6 6 6 6 6 6 6 6 6 6 6 6 6 6 6 6 6 6 6 6 1 1 1 1 1 1 1 1 1 1 1 1 1 1 1 1 1 1 1 1
symmnumber: 1
zpe: 955449.2 jmol-1
zpe.correction: 0.363911 hartree
zpe.thermalcorrener: 0.389213 hartree
zpe.thermalcorrenthalpy: 0.390157 hartree
zpe.thermalcorrgfe: 0.305080 hartree
zpe.sumelectzpe: -1220.701412 hartree
zpe.sumelectthermal: -1220.676111 hartree
zpe.sumelectthermalent: -1220.675167 hartree
zpe.sumelectthermalfe: -1220.760244 hartree
dipole: 3.8498 -2.9043 -0.6934
dipole: 4.8721
quadrupole: -139.3967 -130.7273 -157.9341
quadrupole: 4.8409 6.6577 4.5840
quadrupole: 3.2893 11.9588 -15.2481 4.8409 6.6577 4.5840
hfenergy: -1221.0653238 hartree
pointgroup: C01 [X(C21H20N2O4)]
dipole: 1.6287602 0.9750021 0.2659079 debye
polarizability: 340.2095133|5.6292359|298.0835155|-16.9797437|27.9238926|166.0693609 unknown
InChI: InChI=1S/C21H20N2O4/c1-4-27-20(24)17-18(21(25)26-3)22-23(16-12-10-14(2)11-13-16)19(17)15-8-6-5-7-9-15/h5-13H,4H2,1-3H3
charge 0 multiplicity 1
47 atoms
O  -2.874552 1.614315 0.76036
O  -2.144514 -3.770039 -0.514807
O  -3.581904 0.422609 -1.113898
O  -3.592666 -2.268863 0.532622
N  0.678516 -0.787686 -0.075054
N  -0.053458 -1.97156 -0.07681
C  -0.140294 0.35473 -0.072634
C  -1.46438 -0.133138 -0.059692
C  2.113956 -0.892275 -0.008057
C  0.379104 1.732659 -0.234578
C  -1.355798 -1.564178 -0.078522
C  2.878354 0.016875 0.757059
C  2.746599 -1.959822 -0.68754
C  -2.729814 0.627478 -0.219212
C  -0.004021 2.766051 0.66036
C  1.260023 2.038401 -1.308455
C  4.940537 -1.187227 0.133472
C  4.28033 -0.133021 0.813683
C  4.145861 -2.09792 -0.612827
C  -2.476549 -2.52899 0.021388
C  0.49442 4.076284 0.489294
C  1.751666 3.348933 -1.478189
C  1.373795 4.372853 -0.577562
C  6.44687 -1.357533 0.217699
C  -4.137721 2.414722 0.677581
C  -4.123619 3.383862 1.854881
C  -3.204808 -4.800662 -0.407818
H  2.39069 0.825574 1.308035
H  2.134648 -2.670429 -1.24963
H  -0.691943 2.534318 1.478052
H  1.548824 1.251566 -2.01372
H  4.867681 0.576971 1.407304
H  4.630113 -2.926353 -1.143583
H  0.196877 4.86428 1.19002
H  2.424809 3.571725 -2.313073
H  1.758337 5.390433 -0.708686
H  6.889441 -1.538332 -0.778855
H  6.932806 -0.465723 0.649015
H  6.714354 -2.223414 0.853448
H  -4.158004 2.930476 -0.299427
H  -4.98859 1.711322 0.714684
H  -5.047163 3.991115 1.849253
H  -4.07372 2.838054 2.812538
H  -3.259916 4.068974 1.794936
H  -4.118992 -4.462435 -0.924016
H  -3.439956 -4.998835 0.651733
H  -2.777626 -5.689047 -0.892975
