program: Gaussian 09
title: 000178782
version: EM64L-G09RevD.01
frameworkgroup: C1[X(C15H12ClNO3)]
method: RPBEPBE
basis: SDD
operation: Freq
keyword: #p
keyword: freq=noraman
keyword: PBEPBE/SDD
title: #p freq=noraman PBEPBE/SDD
converged: YES YES NO NO
title: Mulliken charges:
elementType: Cl O O O N C C C C C C C C C C C C C C C H H H H H H H H H H H H
charge: -0.054679 -0.236080 -0.233684 -0.263718 -0.132934 0.261409 0.055934 0.372789 0.165414 0.345427 -0.343352 -0.307062 -0.280270 -0.422193 -0.373716 -0.325525 -0.082132 -0.197739 -0.247138 -0.683068 0.283031 0.258575 0.320368 0.262482 0.254580 0.251923 0.257406 0.209260 0.209378 0.208619 0.233330 0.233363
chargesum: 0.00000
title: Mulliken charges with hydrogens summed into heavy atoms:
elementType: Cl O O O N C C C C C C C C C C C C C C C
charge: -0.054679 -0.236080 -0.233684 -0.263718 -0.132934 0.261409 0.055934 0.372789 0.165414 0.345427 -0.060320 -0.048487 0.040098 -0.159710 -0.119136 -0.073602 -0.082132 0.059667 0.171500 -0.007756
polarizability: 3.74739817e+02 -7.43934687e+00 1.70976623e+02 -2.27348086e-02 -8.14788139e-02 8.06166451e+01
1716.lowfreq: -5.3425 -0.0024 -0.0012 0.0008 3.3211 11.6884 20.2072 39.1070 51.5753
frequency: 20.1879 39.0887 51.5751 58.7487 97.5368 121.0571 131.3652 159.1643 162.7560 197.4480 240.8061 241.4929 271.2937 279.3963 336.8979 352.6007 369.8282 389.6218 405.0605 422.1109 424.8151 477.4221 512.7062 557.0266 583.4279 596.4810 625.2057 642.9059 670.5300 684.9770 709.2209 729.6776 746.3070 798.2199 804.2836 816.2427 834.9957 839.9699 846.1422 858.9010 884.1959 897.1696 902.6149 937.3980 945.2758 981.0881 999.6005 1036.3595 1041.3663 1097.6757 1113.2938 1119.8339 1131.3656 1136.2504 1156.2203 1177.3250 1199.1639 1225.6844 1240.1064 1266.2888 1271.7285 1302.7055 1366.5233 1376.7302 1384.2584 1402.2255 1423.1304 1426.6660 1441.9945 1461.1295 1476.0274 1483.8375 1495.4429 1533.9935 1587.1680 1610.4635 1617.7301 1625.1665 2955.4564 2998.8991 3013.9061 3096.2018 3108.0648 3161.2245 3164.8516 3165.8151 3180.6401 3185.1582 3186.0943 3194.0577
redmass: 6.9749 4.1077 6.6555 4.5841 8.3870 1.6909 4.4224 7.6654 9.1832 7.8183 5.0100 1.2313 7.2865 6.9425 5.4999 7.8128 8.6595 6.9376 4.6877 3.1207 3.0486 5.7786 2.6286 7.2868 4.3600 7.0287 7.3037 11.2350 8.0062 8.7121 3.6236 4.8230 5.2468 5.7152 1.2991 1.4231 1.1130 8.9035 1.5012 1.3887 8.3069 9.7726 3.3731 1.3443 1.3323 1.2946 2.8241 2.7920 1.9005 3.4176 1.7711 1.5762 1.8294 1.4365 2.3151 1.3841 4.3778 2.9046 2.3683 1.1400 2.8735 1.2882 1.6397 4.4803 3.0847 1.3088 3.8709 4.6459 3.2387 1.0395 1.2164 1.3485 1.3984 10.9769 7.0853 8.9999 8.4562 7.0562 1.0554 1.0363 1.1076 1.0989 1.1014 1.0880 1.0898 1.0890 1.0963 1.0975 1.0967 1.0947
irintensity: 0.3679 0.9508 0.2589 0.1295 0.1340 2.3788 0.9667 3.3261 2.5389 0.0004 0.1641 1.0294 0.8292 2.2968 1.8218 0.2114 0.0465 1.4671 4.4505 0.6902 10.7538 4.7039 18.5185 6.7729 8.6550 28.2402 3.1727 4.9554 4.0450 4.5938 0.3828 0.0380 67.0955 59.4942 35.9760 40.3401 2.9336 16.1310 71.2895 32.8447 112.9561 24.9167 23.8781 2.0927 0.5701 1.3972 20.7175 88.1120 29.3567 11.3586 4.5797 14.4924 28.3434 4.6679 88.5385 245.5312 483.6443 144.1714 5.6583 0.0137 21.5866 1.1041 5.2621 4.2881 20.4335 52.8985 2.9377 14.9705 148.5950 12.1503 178.0044 175.5528 96.4196 945.8955 1.4694 74.3210 51.7918 52.1374 44.1038 27.4240 36.9012 29.2730 33.8547 10.8039 3.6385 1.3231 3.2488 2.2509 19.0339 0.8908
temp: 298.150 k
press: 1.00000 atm
elementType: 17 8 8 8 7 6 6 6 6 6 6 6 6 6 6 6 6 6 6 6 1 1 1 1 1 1 1 1 1 1 1 1
symmnumber: 1
zpe: 617829.7 jmol-1
zpe.correction: 0.235319 hartree
zpe.thermalcorrener: 0.252682 hartree
zpe.thermalcorrenthalpy: 0.253626 hartree
zpe.thermalcorrgfe: 0.188309 hartree
zpe.sumelectzpe: -1317.831798 hartree
zpe.sumelectthermal: -1317.814435 hartree
zpe.sumelectthermalent: -1317.813490 hartree
zpe.sumelectthermalfe: -1317.878808 hartree
dipole: 4.1261 -0.2001 0.0086
dipole: 4.1310
quadrupole: -103.5123 -115.5305 -126.7029
quadrupole: -11.4839 0.0654 -0.0253
quadrupole: 11.7362 -0.2819 -11.4543 -11.4839 0.0654 -0.0253
hfenergy: -1318.0671166 hartree
pointgroup: C01 [X(C15H12Cl1N1O3)]
dipole: -1.6207619 0.0404183 -0.1137436 debye
polarizability: 374.057867|-0.9072461|124.5187214|14.9073372|-45.1699891|127.756497 unknown
InChI: InChI=1S/C15H12ClNO3/c1-2-18-11-4-6-12(7-5-11)19-15-17-13-8-3-10(16)9-14(13)20-15/h3-9H,2H2,1H3
charge 0 multiplicity 1
32 atoms
Cl 7.323512 0.041773 0.103666
O  2.242196 0.974291 -1.108771
O  -0.045983 0.815026 -1.055903
O  -5.310181 -0.706693 0.266682
N  1.352278 -0.550711 0.418126
C  3.319093 0.359102 -0.422141
C  2.772939 -0.570483 0.508613
C  -1.359453 0.375907 -0.66489
C  1.098306 0.349429 -0.521133
C  -4.021406 -0.295052 -0.097269
C  4.686037 0.591319 -0.5937
C  3.635189 -1.324056 1.327749
C  -1.619435 -0.600434 0.323115
C  -2.395391 1.016201 -1.367355
C  -2.960493 -0.927643 0.597996
C  -3.736601 0.682853 -1.086094
C  5.519599 -0.181931 0.244287
C  5.027866 -1.119223 1.185689
C  -6.456531 -0.081062 -0.424426
C  -7.71933 -0.705285 0.162361
H  5.0833 1.309367 -1.313335
H  3.242805 -2.044175 2.050284
H  -0.797029 -1.083212 0.854546
H  -2.146268 1.765724 -2.123795
H  -3.205304 -1.677953 1.355439
H  -4.53571 1.1856 -1.636858
H  5.732915 -1.683573 1.802082
H  -6.433916 1.015583 -0.256544
H  -6.379907 -0.27532 -1.514249
H  -8.615186 -0.27144 -0.317812
H  -7.72733 -1.796113 -0.002105
H  -7.778079 -0.517315 1.247846
