program: Gaussian 09
title: 000178753
version: EM64L-G09RevD.01
frameworkgroup: C1[X(C13H8O)]
method: RPBEPBE
basis: SDD
operation: Freq
keyword: #pfreq=noraman
keyword: PBEPBE/SDD
title: #p freq=noraman PBEPBE/SDD
converged: NO NO NO NO
title: Mulliken charges:
elementType: O C C C C C C C C C C C C C H H H H H H H H
charge: -0.229541 -0.035615 0.169831 0.486773 0.524945 -0.387922 -0.476843 -0.032598 -0.378043 -0.420736 -0.403146 -0.329162 -0.213599 -0.177890 0.275056 0.254809 0.230086 0.237961 0.225799 0.254489 0.214226 0.211117
chargesum: 0.00000
title: Mulliken charges with hydrogens summed into heavy atoms:
elementType: O C C C C C C C C C C C C C
charge: -0.229541 -0.035615 0.169831 0.486773 0.524945 -0.112866 -0.222033 -0.032598 -0.147957 -0.182775 -0.177347 -0.074673 0.000627 0.033228
polarizability: 2.46448044e+02 -8.52497149e+00 1.73033342e+02 -3.07853005e-03 3.25140135e-03 5.28611681e+01
1716.lowfreq: -6.7291 -0.0005 0.0005 0.0005 1.3598 9.9240 90.3444 142.4371 204.0470
frequency: 90.3314 142.4367 204.0463 205.6370 281.0567 332.6884 345.2310 387.9365 398.2725 464.6456 502.7963 529.1388 574.3899 590.7390 604.9383 629.9194 684.1576 700.9970 755.5281 778.0630 779.9280 841.0697 845.0007 853.0270 918.5416 937.4525 948.4109 980.7566 981.3344 992.9475 1015.0656 1018.9816 1067.4598 1103.5186 1143.5592 1194.3645 1198.9686 1260.4561 1264.0685 1330.5831 1347.1398 1381.4414 1395.3649 1432.2921 1447.3537 1458.7934 1519.5498 1534.5252 1542.5112 1560.7784 1611.5718 1621.1319 3093.1856 3099.9788 3113.4439 3115.7359 3134.2450 3153.4998 3183.0021 3206.9960
redmass: 7.1783 3.8244 4.1480 5.0392 8.1494 3.8176 6.0729 3.2143 7.9932 5.6455 6.6085 3.0932 3.3246 5.6396 5.4142 2.7547 6.4054 3.3020 1.2717 1.7187 5.6316 2.0466 2.0945 5.7495 1.4296 6.2381 1.4112 2.8598 1.3968 1.3884 1.3761 4.2386 1.2948 2.5331 1.7692 2.1129 1.4214 1.3927 1.4724 2.7906 1.9895 1.7577 2.6417 4.3952 1.9723 4.0356 6.1125 6.1634 6.6967 4.5841 6.8143 7.3101 1.0833 1.0875 1.0904 1.0888 1.0950 1.0969 1.0899 1.1041
irintensity: 2.0813 0.8374 12.4982 0.5739 3.2438 0.6157 0.9387 1.6137 5.0348 2.6879 5.8007 1.2382 0.0388 1.6389 0.4667 1.5554 3.8683 12.1169 21.5776 20.9461 1.3606 107.1001 16.1638 3.4117 0.3749 3.1036 1.9388 0.3011 6.0026 2.3167 0.0678 3.3659 10.5984 10.5546 9.6669 13.5277 20.6225 14.1373 14.9763 3.8201 53.1991 0.3393 15.5390 33.8923 5.0754 2.3740 41.0047 134.2230 37.4173 131.1119 15.6374 23.2909 4.4447 2.1269 4.4970 31.5325 40.7067 16.8127 1.1227 7.2136
temp: 298.150 k
press: 1.00000 atm
elementType: 8 6 6 6 6 6 6 6 6 6 6 6 6 6 1 1 1 1 1 1 1 1
symmnumber: 1
zpe: 435626.0 jmol-1
zpe.correction: 0.165921 hartree
zpe.thermalcorrener: 0.175642 hartree
zpe.thermalcorrenthalpy: 0.176586 hartree
zpe.thermalcorrgfe: 0.130882 hartree
zpe.sumelectzpe: -574.448747 hartree
zpe.sumelectthermal: -574.439026 hartree
zpe.sumelectthermalent: -574.438082 hartree
zpe.sumelectthermalfe: -574.483786 hartree
dipole: 6.3681 -1.3963 -0.0007
dipole: 6.5194
quadrupole: -85.6964 -64.8579 -85.1108
quadrupole: 2.8449 0.0044 -0.0011
quadrupole: -7.1413 13.6971 -6.5558 2.8449 0.0044 -0.0011
hfenergy: -574.6146682 hartree
pointgroup: C01 [X(C13H8O1)]
dipole: 2.4974673 0.5843467 0.000266 debye
dipolederiv: -1.3060351 -0.0285167 0.0003453 -0.2922694 -0.3711322 0.0001267 -0.0004681 -0.0000649 -0.3513055 0.3385319 0.322126 -0.0001116 -0.1495711 -0.6776256 -0.0000625 0.0001484 -0.0000478 -0.06711 -0.6970033 -0.0375078 -0.0000341 0.467 -0.3770182 0.0000022 0.0001239 -0.0002169 -0.0332423 -0.1802049 -0.1031549 0.000012 0.5650993 0.4375139 -0.0000133 0.0001945 0.0000991 0.0863042 0.2850278 -0.0590153 0.0000957 0.1175967 0.2796618 -0.0000458 0.0000015 -0.0000364 0.1288591 0.3396221 0.0572187 -0.0000302 -0.1952634 0.2130452 0.0000391 -0.0001069 0.000082 -0.0977939 -0.4825177 -0.1941818 -0.0000017 -0.2522304 -0.0896434 0.0000605 0.0000235 0.0000147 -0.2660053 1.4278001 0.0190596 -0.0001183 0.0862123 0.4778205 -0.0001516 0.0000582 0.0000433 0.1444274 0.0862963 0.1272079 -0.000039 0.0183826 0.1701701 -0.0001258 0.0002775 -0.0000991 -0.1689196 0.0670076 0.0811452 -0.0000246 -0.1583687 0.3140022 0.0000305 -0.0000761 0.0000208 -0.0961934 -0.3445778 -0.0716912 -0.0000211 -0.0453819 0.1116909 0.0000046 -0.0000936 -0.0000278 -0.1581692 0.0516978 -0.1798458 -0.0000447 -0.3618768 -0.1385916 0.0000419 -0.0001703 0.0001048 -0.1042997 0.0698723 -0.062484 0.0000088 0.0477247 -0.2200454 0.0000304 0.000024 0.0000078 -0.1503199 0.2677299 0.0793274 -0.0000062 0.0655013 0.0691217 -0.000015 0.0000226 0.0000293 -0.0983334 0.0399111 -0.0839436 0.0000072 -0.0364172 0.0559879 -0.0000065 0.0000276 0.0000379 0.1649951 0.0616241 0.0926738 0.0000068 0.0374611 -0.0502205 -0.0000226 -0.0000106 -0.0000359 0.1886443 0.0705758 -0.0785034 -0.0000247 0.0130113 -0.1123912 0.0000821 0.0000203 0.0000794 0.1456111 0.0322568 0.0576291 0.0000066 0.1006498 -0.0658732 -0.0000198 -0.000023 -0.0000485 0.1395 0.073393 0.0332194 -0.0000039 -0.0122884 -0.1110649 0.0000104 -0.0000002 0.0000517 0.1437927 -0.0089579 0.096895 -0.000024 0.0646116 0.0213436 0.0000452 0.0000175 0.0000223 0.1527402 -0.1299208 0.0294727 0.0000052 0.0373739 0.0690253 -0.0000077 0.0000038 -0.0000128 0.1521669 -0.0621291 -0.0971305 -0.0000035 -0.1169572 -0.0057767 -0.000003 0.0000054 -0.000003 0.1446513 unknown
polarizability: 246.19514|9.5487196|173.286246|0.0030327|0.0032942|52.8611681 unknown
InChI: InChI=1S/C13H8O/c14-12-8-6-10-4-2-1-3-9-5-7-11(12)13(9)10/h1-8H
charge 0 multiplicity 1
22 atoms
O  -3.677362 -0.264071 -0.000509
C  0.033999 -0.144848 0.000125
C  -1.278492 -0.67798 0.000275
C  0.981669 -1.294876 -0.00007
C  0.289152 1.254991 0.000174
C  -1.180013 -2.1239 -0.000046
C  0.17558 -2.493024 -0.000129
C  -2.4711 0.169962 0.000791
C  -0.89448 2.129864 -0.000124
C  2.38451 -1.248497 -0.000123
C  1.571269 1.870631 0.000114
C  -2.176773 1.633682 -0.000129
C  3.21737 -0.099228 -0.00003
C  2.850577 1.267644 0.000073
H  -2.045177 -2.79021 -0.000025
H  0.577615 -3.507739 -0.000226
H  -0.723085 3.21417 -0.000464
H  2.901038 -2.218934 -0.000231
H  1.566411 2.969604 0.000027
H  -3.046871 2.301072 -0.000481
H  4.297723 -0.296217 -0.000064
H  3.69384 1.972407 0.000072
