program: Gaussian 09
title: 000178743
version: EM64L-G09RevD.01
frameworkgroup: C1[X(C9H13NO2)]
method: RPBEPBE
basis: SDD
operation: Freq
keyword: #p
keyword: freq=noraman
keyword: PBEPBE/SDD
title: #p freq=noraman PBEPBE/SDD
converged: YES YES NO NO
title: Mulliken charges:
elementType: O O N C C C C C C C C C H H H H H H H H H H H H H
charge: -0.479834 -0.440226 -0.087483 -0.453694 0.391991 -0.095567 -0.382409 -0.626448 -0.613260 0.170585 -0.211875 -0.351084 0.244794 0.139923 0.267103 0.226103 0.258291 0.185001 0.228358 0.187242 0.228239 0.225487 0.251040 0.355132 0.382592
chargesum: 0.00000
title: Mulliken charges with hydrogens summed into heavy atoms:
elementType: O O N C C C C C C C C C
charge: -0.124702 -0.057635 -0.087483 -0.068977 0.391991 -0.095567 -0.115306 0.042946 0.030579 0.170585 0.013612 -0.100044
polarizability: 1.44103915e+02 -2.43572591e-01 1.19673816e+02 7.06250073e+00 -6.01061934e-01 6.88236616e+01
1716.lowfreq: -13.9057 -8.5582 -0.0009 -0.0008 -0.0004 5.2361 24.5813 70.2355 100.0128
frequency: 23.2840 70.1918 99.9970 158.6771 225.7297 231.7066 244.2920 261.3528 288.5587 296.5687 311.6209 318.8221 345.1665 426.9715 470.6744 493.3815 514.3264 546.8090 552.9516 579.6699 706.9728 731.4452 784.2762 802.4108 821.7315 894.6413 924.6820 964.9613 982.2970 1036.1694 1038.7240 1056.8891 1089.3642 1126.1718 1133.5296 1165.3319 1172.3322 1179.6790 1205.0699 1257.9431 1263.5922 1286.8852 1330.7189 1360.8753 1412.8105 1417.3165 1439.0880 1452.6268 1459.7710 1464.7566 1472.4008 1476.0342 1478.7136 1485.6518 1611.7460 1628.3924 2705.6442 2850.5016 2864.1129 2990.3152 3021.7134 3034.5409 3081.3876 3095.3014 3138.4929 3158.9082 3175.9203 3519.9626 3559.9918
redmass: 3.2933 2.9685 3.7389 5.2233 1.1614 1.1357 2.8826 3.2907 4.1697 3.5252 2.8047 1.3502 1.9129 2.4108 4.8918 1.2946 2.6755 5.4547 3.9167 5.5625 4.7569 3.8054 1.4690 4.8806 4.9549 1.3653 2.6903 1.4041 1.7947 1.5825 2.0896 1.9017 1.2537 1.4100 1.4323 1.7016 1.8861 1.2101 2.4420 2.5234 2.5662 1.6265 1.6942 1.4672 3.8012 1.1440 1.1996 1.0952 1.0577 3.1169 1.0870 1.1159 2.5520 1.0802 6.9414 6.7251 1.0706 1.0571 1.0569 1.0828 1.0724 1.0726 1.1011 1.1008 1.0864 1.0931 1.0977 1.0647 1.0658
irintensity: 1.1417 0.5240 0.0880 0.3548 1.3382 0.3906 1.0044 12.8305 3.3395 24.4710 20.2094 102.9980 14.5713 6.5549 7.0805 104.1687 36.2836 2.3353 3.9242 17.7367 7.5210 14.8549 54.5362 36.8233 5.7496 0.2682 19.4965 10.3054 14.9939 26.0178 82.1597 12.3158 7.2653 106.7627 43.7081 71.3138 8.2650 21.7905 149.1097 98.5608 10.1656 6.3119 35.3285 35.1705 4.4639 4.3002 4.1621 3.3849 21.9892 135.4940 6.8177 2.9778 0.3131 12.3754 18.5979 9.2225 164.7746 67.1678 208.5239 22.6340 40.8735 32.9641 29.8826 28.6955 5.7388 7.9059 12.1028 66.4301 54.4944
temp: 298.150 k
press: 1.00000 atm
elementType: 8 8 7 6 6 6 6 6 6 6 6 6 1 1 1 1 1 1 1 1 1 1 1 1 1
symmnumber: 1
zpe: 536965.1 jmol-1
zpe.correction: 0.204519 hartree
zpe.thermalcorrener: 0.216941 hartree
zpe.thermalcorrenthalpy: 0.217885 hartree
zpe.thermalcorrgfe: 0.165762 hartree
zpe.sumelectzpe: -555.009382 hartree
zpe.sumelectthermal: -554.996960 hartree
zpe.sumelectthermalent: -554.996016 hartree
zpe.sumelectthermalfe: -555.048139 hartree
dipole: -3.7352 -1.5287 -0.0610
dipole: 4.0364
quadrupole: -74.6894 -65.5171 -73.7372
quadrupole: 3.4333 -0.0364 0.7861
quadrupole: -3.3748 5.7974 -2.4226 3.4333 -0.0364 0.7861
hfenergy: -555.213901 hartree
pointgroup: C01 [X(C9H13N1O2)]
dipole: -1.4791876 -0.5777671 -0.0043965 debye
dipolederiv: -0.2998085 -0.0217109 0.0269318 -0.0865564 -1.2500447 -0.0357003 -0.0026383 -0.0584885 -0.4081306 -0.9350018 0.5905251 -0.0355781 0.6529452 -0.640829 0.0719228 -0.0549343 0.0703322 -0.4189814 -0.6834402 -0.0390998 -0.0110872 0.0016206 -0.5562567 0.0160599 0.0832057 0.0293925 -0.508844 0.4820291 -0.0762569 -0.153069 -0.1563654 0.5136731 0.0114495 -0.2452386 -0.0463368 0.21901 0.0593985 0.0310448 0.0334614 -0.0354216 -0.0809208 -0.0169133 0.1038804 0.0232201 -0.0304936 -0.2024852 0.3519999 -0.0011086 0.0357223 0.9599775 0.0407444 0.0009493 0.0687304 -0.0077855 -0.1285432 -0.0836497 0.0137836 0.0123541 -0.1034449 0.0067492 -0.0179024 -0.0007462 -0.184306 0.0087355 0.005658 -0.0043302 0.0509194 0.3376701 -0.0851012 -0.0936903 -0.0907732 0.415192 0.4799278 0.1123066 0.0970721 0.1616524 0.3609578 -0.0312952 0.1852496 -0.0212298 0.1333195 0.7959703 -0.7411908 0.0706237 -0.588959 0.4175264 -0.0639711 0.0789916 -0.0760765 0.0814871 0.0542193 0.0818755 0.0281798 -0.0561922 0.0915905 -0.0028128 0.0342326 0.0209232 -0.1652736 -0.0328075 -0.0152258 0.0284041 0.2258832 -0.0954502 0.0317468 0.022014 0.0021057 -0.1828034 -0.0374863 -0.0276711 -0.0657834 0.0195212 0.0559902 0.003487 -0.0469405 -0.0229973 -0.1251494 -0.0918876 0.0370017 0.0402932 0.1668893 -0.3684999 -0.0336386 0.0136801 0.1027559 0.0313181 0.0329084 0.102157 -0.0270336 0.0921883 0.0580079 -0.0051183 -0.0279529 -0.0076154 0.1509747 -0.0564154 0.1057196 0.1320715 0.1174947 0.0126076 -0.0546864 0.0748138 -0.0313175 0.0187663 -0.0490721 -0.0666845 -0.1225061 -0.0664547 0.051117 -0.0062087 -0.1151498 -0.0042045 0.0674787 0.0585172 -0.0275433 0.0270802 -0.0767108 -0.2147391 0.2086247 0.0252365 0.0185859 -0.0818415 -0.0958955 0.0636084 0.0476879 0.1061776 0.0040674 -0.0686124 0.12717 -0.072982 0.0598403 -0.0836131 -0.022974 -0.0452244 -0.2504493 -0.2461581 0.0089316 -0.0054706 0.0767497 0.0490595 0.0925131 -0.0158205 0.0132327 -0.038524 0.0787878 0.0303939 -0.0756165 0.0379074 -0.1744126 0.0751928 -0.0224392 -0.0079368 -0.0376791 -0.1257757 -0.0065296 -0.0076797 -0.0107412 0.1582547 -0.0529067 -0.0586858 -0.0285978 -0.052433 0.0812619 -0.008695 -0.0324035 -0.0136686 0.1692193 0.2557413 -0.1316061 -0.0400396 -0.0426119 0.389711 0.0091696 -0.0149167 0.0235722 0.3517799 0.3542097 -0.1313383 -0.0165272 -0.155011 0.2691727 -0.0199963 -0.0088894 -0.0170977 0.3823213 unknown
polarizability: 144.5056649|-0.9303741|119.5858132|4.2176806|2.3963315|68.5099142 unknown
InChI: InChI=1S/C9H13NO2/c1-10(2)6-7-4-3-5-8(11)9(7)12/h3-5,11-12H,6H2,1-2H3
charge 0 multiplicity 1
25 atoms
O  1.008782 -2.173039 -0.251716
O  3.395834 -1.018454 0.106508
N  -2.621588 0.162794 0.116086
C  -1.539356 -0.552494 -0.586645
C  -0.160749 0.054422 -0.342513
C  0.990792 -0.753064 -0.21093
C  0.006904 1.463489 -0.287217
C  -2.520236 0.066559 1.586368
C  -3.959323 -0.207551 -0.38447
C  2.279957 -0.183663 -0.024769
C  1.28432 2.033627 -0.104972
C  2.430265 1.213189 0.025535
H  -1.768025 -0.518326 -1.670755
H  -1.54378 -1.65078 -0.311933
H  -0.888224 2.087541 -0.373761
H  -3.292572 0.703044 2.05256
H  -1.531608 0.427135 1.915562
H  -2.656483 -0.979184 1.963747
H  -4.722931 0.421222 0.106331
H  -4.225767 -1.278794 -0.194458
H  -4.015703 -0.027249 -1.472951
H  1.395253 3.122291 -0.064661
H  3.430423 1.633217 0.166007
H  0.091925 -2.541632 -0.298674
H  3.090791 -1.9626 0.047323
