program: Gaussian 09
title: 000178730
version: EM64L-G09RevD.01
frameworkgroup: C1[X(C4H7ClO)]
method: RPBEPBE
basis: SDD
operation: Freq
keyword: #p
keyword: freq=noraman
keyword: PBEPBE/SDD
title: #p freq=noraman PBEPBE/SDD
converged: NO YES NO NO
title: Mulliken charges:
elementType: Cl O C C C C H H H H H H H
charge: -0.145198 -0.180320 -0.423294 -0.459490 -0.249970 -0.290179 0.266168 0.229332 0.238508 0.254316 0.294196 0.225299 0.240630
chargesum: 0.00000
title: Mulliken charges with hydrogens summed into heavy atoms:
elementType: Cl O C C C C
charge: -0.145198 -0.180320 0.072207 0.033335 0.044226 0.175750
polarizability: 6.49560812e+01 2.15387547e+00 4.56442796e+01 -3.78308364e+00 9.72778830e-01 4.84933164e+01
1716.lowfreq: -20.5939 0.0010 0.0019 0.0022 12.9539 22.9461 90.2246 150.9026 305.6674
frequency: 90.0909 150.8407 305.6664 337.6050 521.1576 634.5844 739.2633 821.3579 861.9158 890.5759 915.3144 938.1928 1042.3933 1048.8948 1091.1403 1150.5544 1174.5854 1193.0972 1215.9585 1282.4728 1302.6682 1312.7839 1346.1220 1454.5238 1469.4558 1485.3504 3005.7726 3029.7326 3041.4013 3091.2253 3111.9980 3123.0075 3151.7927
redmass: 2.3056 2.9648 3.9958 5.2714 3.4902 2.6807 4.3583 2.0478 3.1308 1.5256 2.8632 2.3368 2.6765 1.4687 2.6380 1.1342 1.5155 1.3055 1.2302 1.2349 1.3036 1.3560 1.3837 1.0892 1.0863 1.0956 1.0676 1.0570 1.0615 1.1083 1.1045 1.1002 1.0926
irintensity: 4.6496 2.3590 2.8929 17.5959 93.3471 21.0087 24.5439 5.6132 16.7509 13.9273 14.2116 27.6872 41.3311 13.1615 110.7444 27.6080 14.0558 3.4520 14.4080 3.7741 3.9588 14.4975 1.9742 11.4162 12.4439 5.2969 22.2992 35.2435 35.1063 3.6033 23.1121 20.0536 9.7612
temp: 298.150 k
press: 1.00000 atm
elementType: 17 8 6 6 6 6 1 1 1 1 1 1 1
symmnumber: 1
zpe: 277123.9 jmol-1
zpe.correction: 0.105551 hartree
zpe.thermalcorrener: 0.111524 hartree
zpe.thermalcorrenthalpy: 0.112468 hartree
zpe.thermalcorrgfe: 0.075138 hartree
zpe.sumelectzpe: -691.414660 hartree
zpe.sumelectthermal: -691.408687 hartree
zpe.sumelectthermalent: -691.407743 hartree
zpe.sumelectthermalfe: -691.445073 hartree
dipole: -3.3247 1.8099 0.4449
dipole: 3.8114
quadrupole: -44.0099 -44.7569 -40.5900
quadrupole: -0.0693 2.6043 1.9538
quadrupole: -0.8910 -1.6380 2.5289 -0.0693 2.6043 1.9538
hfenergy: -691.5202108 hartree
pointgroup: C01 [X(C4H7Cl1O1)]
dipole: -1.238382 0.7491303 0.3922061 debye
dipolederiv: -0.7313253 -0.0338502 0.2514025 -0.0073288 -0.2960448 -0.0081888 0.4744216 0.0512718 -0.5327696 -0.9857942 -0.156643 0.0746259 -0.4102542 -0.6346923 0.1262825 -0.1026676 -0.0483 -0.3873218 -0.0594335 0.0822204 -0.0451026 0.0399581 -0.123094 -0.0012922 0.0546435 0.0260582 0.0142204 0.0036075 -0.0527375 -0.1112359 -0.0365099 -0.1069844 -0.0025767 -0.0673282 -0.0471126 0.0380146 1.2673979 0.1286377 -0.462355 0.4356441 0.6499495 -0.0812335 -0.6031334 -0.0210217 0.6974813 0.6139958 0.0520261 0.0327755 -0.0936135 0.2393128 0.0354447 0.1448477 0.0571399 0.3108489 0.048385 -0.1024507 0.0063624 -0.0830433 -0.0288066 0.0085914 0.0169888 0.0378081 0.0890897 -0.0040567 0.0632026 0.1027413 0.0392357 0.074044 -0.0458722 0.0396792 -0.0422721 -0.1038784 -0.089146 0.1098788 0.0000017 0.1042556 0.0362262 0.0030766 0.0217671 -0.0060235 0.0946519 0.0789037 -0.0322346 0.0806413 -0.0061106 0.0625539 0.0207959 0.0236746 0.0425832 -0.0841768 -0.0451734 0.0001281 0.0026705 0.0376859 0.0715077 0.0053385 -0.0053422 0.0088464 -0.0805578 -0.1270212 -0.0650428 0.0619045 -0.0174093 0.0525004 0.0277669 0.0858969 0.053349 0.0143196 0.0296605 0.006865 0.0055682 -0.0025099 0.0035276 -0.088133 -0.0834479 -0.1123267 -0.0699219 unknown
polarizability: 63.0422008|1.7473953|45.6215824|-6.6234894|0.8422602|50.4298941 unknown
InChI: InChI=1S/C4H7ClO/c5-4-2-1-3-6-4/h4H,1-3H2
charge 0 multiplicity 1
13 atoms
Cl 1.984689 -0.078502 -0.812575
O  -0.206422 -1.153283 0.580694
C  -0.153031 1.212147 0.546861
C  -1.221226 0.789693 -0.500095
C  0.680693 -0.065445 0.680892
C  -1.377479 -0.737222 -0.266187
H  0.445085 2.081548 0.239619
H  -0.623007 1.425358 1.526713
H  -2.17282 1.328722 -0.365782
H  -0.842398 0.986191 -1.516166
H  1.332943 -0.191509 1.552355
H  -2.275758 -1.007153 0.313772
H  -1.339967 -1.325645 -1.197403
