program: Gaussian 09
title: 000178729
version: EM64L-G09RevD.01
frameworkgroup: C1[X(C8H8OS2)]
method: RPBEPBE
basis: SDD
operation: Freq
keyword: #pfreq=noraman
keyword: PBEPBE/SDD
title: #p freq=noraman PBEPBE/SDD
converged: YES YES NO NO
title: Mulliken charges:
elementType: S S O C C C C C C C C H H H H H H H H
charge: 0.656247 0.291914 -0.598060 -0.633852 -0.067269 -0.125471 -0.600936 -0.259849 -0.255889 -0.227299 -0.209538 0.319795 0.247795 0.233129 0.248207 0.253151 0.251825 0.239710 0.236389
chargesum: 0.00000
title: Mulliken charges with hydrogens summed into heavy atoms:
elementType: S S O C C C C C C C C
charge: 0.656247 0.291914 -0.598060 -0.314057 -0.067269 -0.125471 0.128195 -0.006698 -0.004064 0.012411 0.026851
polarizability: 1.61321232e+02 -1.81611250e+00 1.26028288e+02 -5.40487316e+00 3.73556074e+00 8.08544548e+01
1716.lowfreq: -12.9460 -0.0027 -0.0026 -0.0005 6.8113 9.8545 55.7398 100.5876 146.2740
frequency: 55.5621 100.5721 146.2723 156.2465 221.3691 251.4638 262.7020 312.5266 353.1761 394.4078 424.0374 428.8380 448.2071 514.0350 548.9642 623.5769 643.9334 692.3718 708.0669 759.7217 810.3980 867.4611 948.3210 967.4804 989.3517 991.1945 1020.4926 1029.4314 1074.7480 1087.3737 1123.2690 1138.7742 1175.1795 1248.4313 1256.4416 1375.3136 1394.4255 1421.1526 1429.3356 1457.7967 1464.7114 1567.7608 1582.5655 2983.6974 3077.8800 3084.6668 3102.4562 3136.3185 3143.2292 3156.7144 3172.7101
redmass: 4.2483 5.4595 6.6499 5.2898 1.1402 3.6806 4.8585 4.8387 5.3527 6.1952 5.3185 14.2865 4.6863 4.3158 4.2330 4.8541 6.6177 7.0416 4.5376 1.2231 16.6544 1.3257 1.3848 1.3926 1.3937 5.7059 2.6535 1.4633 3.1011 2.4588 1.5510 1.2818 1.0692 1.3028 1.3591 8.2915 1.1920 2.1590 2.2114 1.0436 1.0443 6.2643 6.6498 1.0358 1.0986 1.0967 1.0911 1.0858 1.0901 1.0948 1.1008
irintensity: 2.7432 4.9932 4.9773 1.5805 0.2532 3.5598 1.7151 6.0304 0.0900 1.4461 10.5137 9.0811 18.3495 2.6423 3.2530 6.3709 1.1822 13.0484 1.5327 87.8736 47.2236 0.2206 0.9902 19.9514 0.0967 1.7637 8.6207 12.2450 0.3934 8.2946 1.9324 2.4780 0.2636 5.6875 13.1168 4.1390 18.4932 10.7123 29.7670 13.6481 9.3767 6.3979 13.3028 18.3053 11.0164 6.7809 8.2923 0.8942 1.7141 11.5293 23.0403
temp: 298.150 k
press: 1.00000 atm
elementType: 16 16 8 6 6 6 6 6 6 6 6 1 1 1 1 1 1 1 1
symmnumber: 1
zpe: 360824.4 jmol-1
zpe.correction: 0.137431 hartree
zpe.thermalcorrener: 0.148059 hartree
zpe.thermalcorrenthalpy: 0.149003 hartree
zpe.thermalcorrgfe: 0.100891 hartree
zpe.sumelectzpe: -1180.109450 hartree
zpe.sumelectthermal: -1180.098822 hartree
zpe.sumelectthermalent: -1180.097878 hartree
zpe.sumelectthermalfe: -1180.145990 hartree
dipole: -1.5709 -2.2478 4.0903
dipole: 4.9245
quadrupole: -65.8157 -81.2983 -86.0385
quadrupole: -4.5727 5.2813 7.5140
quadrupole: 11.9018 -3.5808 -8.3210 -4.5727 5.2813 7.5140
hfenergy: -1180.246881 hartree
pointgroup: C01 [X(C8H8O1S2)]
dipole: -0.4852003 1.0095032 -1.580886 debye
dipolederiv: 0.5972865 -0.1947927 0.0196576 -0.2040614 0.7395051 -0.1925809 0.0797669 -0.387643 0.3906398 -0.4807692 -0.1093221 0.0204503 -0.0507799 -0.1686726 -0.0270095 -0.0845655 -0.0254396 -0.0971963 -0.4864599 0.0605984 0.045276 0.1122909 -0.582002 -0.0425792 -0.1315217 0.3939577 -0.4596302 0.3135109 -0.0564683 -0.1930429 -0.1605505 0.0429561 0.0836096 -0.1663418 0.0050156 0.1760265 -0.2010982 0.029629 -0.0442631 -0.1181222 -0.2431248 0.0510784 -0.0441508 -0.0865754 -0.1875755 0.4864535 0.3959916 0.1847106 0.2506357 0.10085 0.0185575 0.21557 0.0718077 -0.0263817 -0.0883782 -0.0754867 0.0931551 -0.0300169 -0.1097844 0.0835053 0.0380736 -0.005848 -0.0882732 0.0344094 -0.0610483 -0.0123152 0.1443265 0.043309 0.1022325 0.0708544 0.0558085 -0.0494353 -0.3254334 -0.1605776 -0.0838207 -0.0410478 0.0418897 0.0617788 -0.0214031 0.0516201 -0.0960308 -0.0566311 0.1169417 0.0638929 0.0133364 -0.1098842 0.0234825 0.0272211 0.0361983 -0.1446148 0.1467818 -0.0274869 0.0343016 0.0057681 0.0815062 0.0817154 0.0460926 0.0832078 -0.0885723 -0.0191876 0.0081485 -0.0120164 0.01688 0.0318981 0.0321242 -0.0035007 0.0175808 0.0104494 0.0626649 -0.0912201 0.0260795 -0.118391 -0.0568251 0.0217202 0.0199904 0.0271811 0.0597196 0.012287 0.0757602 0.074654 0.1229604 0.0170178 -0.0716502 0.1151012 -0.0283839 0.0179199 -0.025283 0.0308916 -0.1252384 0.0120957 0.1075151 -0.0096516 -0.0730546 0.0017481 0.0470123 0.0939501 0.0464167 0.0086601 -0.0050866 -0.0174572 -0.0763903 -0.0105942 -0.0525077 0.1234579 0.0791206 -0.0037317 -0.0221298 0.0348351 -0.0364885 -0.0624867 0.0017035 -0.0754366 0.1331253 -0.0573736 -0.0627258 -0.0673231 -0.068446 0.0525927 -0.0565519 -0.0655715 -0.0585312 0.132868 -0.0858505 0.0784826 -0.0106881 0.0833735 0.0651991 -0.0209041 -0.0136698 -0.0237604 0.1464916 unknown
polarizability: 160.2560249|-0.0199988|125.2535221|10.9776106|6.6415155|82.6944279 unknown
InChI: InChI=1S/C8H8OS2/c1-6-10-7-4-2-3-5-8(7)11(6)9/h2-6H,1H3
charge 0 multiplicity 1
19 atoms
S  1.49316 -1.365321 0.012444
S  1.150076 1.592372 1.0142
O  1.558859 -2.054627 1.52765
C  2.340549 0.434781 0.12843
C  -0.215385 -0.549212 -0.131072
C  -0.346735 0.763817 0.370084
C  2.69445 0.893474 -1.285417
C  -1.324219 -1.276967 -0.598371
C  -1.621512 1.374325 0.392659
C  -2.600691 -0.667403 -0.574319
C  -2.741528 0.650821 -0.077681
H  3.206002 0.268836 0.789543
H  3.208522 1.870459 -1.252016
H  3.371929 0.169815 -1.776474
H  1.791164 1.010354 -1.910154
H  -1.201789 -2.301036 -0.967314
H  -1.739816 2.395683 0.768421
H  -3.475359 -1.216625 -0.936693
H  -3.729478 1.123353 -0.058219
