program: Gaussian 09
title: 000178742
version: EM64L-G09RevD.01
frameworkgroup: C1[X(C12H20NO2)]
method: RPBEPBE
basis: SDD
operation: Freq
keyword: #p
keyword: freq=noraman
keyword: PBEPBE/SDD
title: #p freq=noraman PBEPBE/SDD
converged: YES YES NO NO
title: Mulliken charges:
elementType: O O N C C C C C C C C C C C C H H H H H H H H H H H H H H H H H H H H
charge: -0.332361 -0.287480 -0.097711 -0.523738 -0.567134 -0.550318 -0.567311 0.362899 0.064930 -0.386083 0.268665 -0.250182 -0.344025 -0.505219 -0.531448 0.268605 0.290803 0.257217 0.263973 0.292434 0.270528 0.263901 0.265538 0.302738 0.274321 0.251860 0.249026 0.249815 0.265875 0.230091 0.235240 0.279045 0.237576 0.237685 0.260247
chargesum: 1.00000
title: Mulliken charges with hydrogens summed into heavy atoms:
elementType: O O N C C C C C C C C C C C C
charge: -0.332361 -0.287480 -0.097711 0.035670 0.246490 0.249649 0.261607 0.362899 0.064930 -0.137058 0.268665 -0.000367 -0.078150 0.239157 0.204059
polarizability: 1.82003061e+02 -1.25369026e+00 1.53596766e+02 1.05683134e+01 -3.02446076e+00 9.63210071e+01
1716.lowfreq: -13.0307 -10.6780 -0.0008 -0.0004 0.0003 9.4521 35.8263 50.4844 76.3036
frequency: 35.4285 50.4377 76.2830 88.5024 113.3324 122.8325 163.9857 178.6832 205.4321 217.4926 233.0977 246.0703 265.4920 268.2821 287.8283 289.9716 328.7268 356.4468 368.3395 410.4628 427.7247 458.6944 493.3773 529.0332 531.4107 554.5383 613.4022 678.3975 701.7923 749.3755 778.3725 791.5845 821.6243 886.6376 891.9040 908.8438 945.0587 952.7087 964.3486 968.3683 1047.2483 1050.6210 1082.7389 1099.6934 1108.4955 1111.1960 1111.4783 1148.1450 1152.6958 1179.4590 1191.6929 1200.5407 1222.1980 1240.4490 1253.9247 1271.1534 1304.1116 1350.0156 1380.5344 1419.1468 1423.5431 1426.4245 1434.7158 1438.7878 1444.2326 1450.1720 1456.9758 1459.3986 1464.8111 1466.9787 1468.1910 1471.2290 1474.4931 1476.6893 1480.0485 1485.1313 1499.5629 1587.3780 1597.2150 2981.1944 3003.1084 3021.2490 3022.8547 3028.4027 3031.7321 3079.1470 3109.8068 3118.3865 3131.9062 3135.7154 3139.0183 3143.0292 3144.4792 3145.1502 3148.0583 3154.0550 3157.8080 3161.5379 3180.1283
redmass: 2.6997 3.2349 1.7157 3.4204 3.4752 2.3975 1.7543 1.3055 2.9569 1.5442 1.8800 1.1209 1.9798 1.5131 2.0994 2.7978 4.5579 4.2024 2.2244 2.5595 2.1303 2.9002 4.5757 4.7714 4.1606 4.0001 4.6951 4.9040 4.9907 2.0027 5.5339 2.1652 3.6852 1.6390 2.3567 3.8112 5.3297 2.9735 2.0292 1.3348 1.2762 3.2839 1.7098 1.4190 1.3783 1.2487 1.2368 1.3754 1.3866 1.4325 1.4450 2.1531 1.7510 1.8121 1.8399 2.9482 1.5855 1.4333 4.8410 1.1448 1.1547 1.2821 1.1863 1.1833 1.0904 1.1818 1.2126 1.5245 1.5462 1.1236 1.0603 1.0507 1.1947 1.0531 1.1167 1.1067 1.0524 5.8795 7.4879 1.0321 1.0323 1.0318 1.0332 1.0391 1.0517 1.1053 1.1068 1.1012 1.0905 1.1047 1.1045 1.1045 1.1011 1.1056 1.1048 1.1058 1.1054 1.0902 1.0980
irintensity: 0.0467 1.9431 6.2865 1.5897 9.8090 2.2100 0.3078 0.7248 3.0453 1.9126 4.9172 0.4131 3.3497 2.3367 1.4249 2.5791 4.5505 5.4356 0.1306 1.1177 0.1018 0.6015 5.8538 2.6453 0.6586 0.7962 7.8744 9.3724 10.0233 43.0606 8.7199 67.6758 65.6489 7.3443 11.2497 13.0867 41.9836 43.9739 7.3982 0.7003 4.9950 53.0612 18.9562 5.7637 5.8505 0.7933 3.2532 4.3704 10.9199 14.0021 24.7186 50.0841 2.5554 2.1041 46.4114 161.6540 30.4833 12.9918 35.3289 19.9443 11.3068 9.7399 7.7174 4.5417 11.1075 58.9978 19.2400 36.4807 85.9446 6.2570 18.9579 17.5459 32.4483 9.7482 42.1433 17.1598 90.8423 47.1751 6.3466 41.8867 49.7530 3.8253 3.5393 10.8514 20.0994 28.8964 0.6791 22.7207 5.5406 0.0324 6.8884 4.1072 10.6881 4.7024 3.8796 7.0432 1.5909 5.1982 3.8874
temp: 298.150 k
press: 1.00000 atm
elementType: 8 8 7 6 6 6 6 6 6 6 6 6 6 6 6 1 1 1 1 1 1 1 1 1 1 1 1 1 1 1 1 1 1 1 1
symmnumber: 1
zpe: 795053.8 jmol-1
zpe.correction: 0.302820 hartree
zpe.thermalcorrener: 0.319662 hartree
zpe.thermalcorrenthalpy: 0.320606 hartree
zpe.thermalcorrgfe: 0.259043 hartree
zpe.sumelectzpe: -673.025980 hartree
zpe.sumelectthermal: -673.009139 hartree
zpe.sumelectthermalent: -673.008194 hartree
zpe.sumelectthermalfe: -673.069757 hartree
dipole: -5.9458 0.0747 0.7151
dipole: 5.9891
quadrupole: -27.6482 -73.1428 -84.5405
quadrupole: 1.5023 0.0800 2.0794
quadrupole: 34.1290 -11.3657 -22.7633 1.5023 0.0800 2.0794
hfenergy: -673.3288004 hartree
pointgroup: C01 [X(C12H20N1O2)]
dipole: -2.3343793 -0.0855953 -0.3089613 debye
polarizability: 182.0901034|2.6984126|153.8946921|-9.5111139|-0.1462998|95.936038 unknown
InChI: InChI=1S/C12H20NO2/c1-13(2,3)9-10-7-6-8-11(14-4)12(10)15-5/h6-8H,9H2,1-5H3
charge 1 multiplicity 1
35 atoms
O  0.269381 1.683018 0.308026
O  2.886168 0.820637 -0.36748
N  -2.774828 0.07453 -0.29684
C  -1.779377 -0.097198 0.920905
C  -3.175145 -1.289589 -0.844226
C  -4.012816 0.80155 0.217889
C  -2.133443 0.89584 -1.41343
C  -0.41254 -0.60843 0.552909
C  0.630247 0.327017 0.291803
C  -0.133872 -2.002146 0.538457
C  1.939527 -0.149746 -0.042055
C  1.162252 -2.462746 0.245416
C  2.19242 -1.54222 -0.049606
C  1.174294 2.677918 0.951291
C  4.245116 0.375439 -0.726991
H  -2.301877 -0.783859 1.60841
H  -1.711884 0.907987 1.36698
H  -3.711051 -1.851224 -0.0632
H  -3.830379 -1.145503 -1.717359
H  -2.26644 -1.83235 -1.141147
H  -3.728738 1.820163 0.522212
H  -4.766716 0.849079 -0.582992
H  -4.421587 0.254455 1.081504
H  -1.71255 1.81608 -0.985175
H  -1.319017 0.310353 -1.863198
H  -2.903578 1.1190 -2.168364
H  -0.923514 -2.717907 0.794497
H  1.380756 -3.534506 0.248771
H  3.191026 -1.916174 -0.291766
H  1.435947 2.347716 1.972375
H  0.581218 3.603704 0.989949
H  2.083657 2.812956 0.350221
H  4.222867 -0.267273 -1.626213
H  4.723407 -0.15797 0.114921
H  4.79557 1.301197 -0.943997
