program: Gaussian 09
title: 000178728
version: EM64L-G09RevD.01
frameworkgroup: C1[X(C6H7N7S)]
method: RPBEPBE
basis: SDD
operation: Freq
keyword: #pfreq=noraman
keyword: PBEPBE/SDD
title: #p freq=noraman PBEPBE/SDD
converged: NO YES NO NO
title: Mulliken charges:
elementType: S N N N N N N N C C C C C C H H H H H H H
charge: 0.220314 -0.170161 -0.068479 -0.660749 -0.076944 -0.616679 -0.632353 -0.085393 -0.225347 -0.185333 -0.222308 0.322325 0.252722 -0.257578 0.296548 0.364227 0.334915 0.355050 0.320467 0.310536 0.424219
chargesum: 0.00000
title: Mulliken charges with hydrogens summed into heavy atoms:
elementType: S N N N N N N N C C C C C C
charge: 0.220314 -0.170161 -0.068479 0.038394 -0.076944 0.058838 0.102402 -0.085393 -0.225347 -0.185333 0.074239 0.322325 0.252722 -0.257578
polarizability: 3.30195912e+02 -2.29147677e+00 1.25427983e+02 -5.82985062e-02 -2.87193917e-02 5.17815126e+01
1716.lowfreq: -0.0026 -0.0025 -0.0010 2.4213 6.0723 6.5936 43.3580 53.1736 73.2960
frequency: 43.3435 53.1422 73.2960 93.9196 113.1838 145.8558 183.3210 211.7512 247.2523 301.6998 319.0386 345.7500 376.1433 439.3557 465.0219 488.5894 494.7000 503.2746 512.8880 542.0547 556.4523 581.4705 604.4384 627.7252 685.6877 691.0442 700.2089 728.7413 785.7073 890.3933 898.1166 901.9287 933.7870 1030.3416 1072.1404 1086.0841 1138.7384 1173.1951 1247.4612 1266.3272 1408.6339 1464.0783 1508.2107 1531.8923 1546.5364 1566.4034 1615.4339 1641.1018 1652.1508 2114.1691 3126.3650 3206.7378 3514.1341 3557.6526 3611.5435 3660.1884 3711.1472
redmass: 6.0595 5.3262 8.8105 5.2180 8.8111 6.3607 8.1106 4.7934 7.9526 1.3373 3.1029 8.1063 5.2165 4.0460 1.2700 3.1300 3.8334 1.4251 4.9856 3.6888 1.1612 1.2676 9.5235 6.7389 8.6112 8.0130 6.6336 5.8248 6.9364 1.3388 1.1433 6.1941 6.4601 1.7312 1.9763 2.0137 1.8367 5.3236 1.8148 6.7024 5.5933 4.5651 2.4107 5.0627 3.4569 4.5002 1.6155 1.2772 1.6497 12.5769 1.0705 1.0960 1.0460 1.0455 1.0859 1.1043 1.1053
irintensity: 3.1716 15.8388 3.3542 0.1769 5.7131 9.2820 5.1002 1.0884 4.8846 6.1371 15.2019 10.5624 13.6979 1.3656 62.8322 22.1226 9.0410 396.9589 11.1317 72.7128 0.0487 160.9671 9.3366 2.5941 33.5249 8.1077 19.4519 2.0783 13.1070 76.9619 97.1305 11.6010 39.8518 4.2179 15.6094 6.1191 95.4493 32.3731 89.3780 146.9712 64.3407 261.1414 899.5509 854.3672 430.2039 261.7168 230.6689 370.5460 951.2256 260.0557 258.2945 1.6070 64.8504 166.0157 68.0345 34.9618 47.6733
temp: 298.150 k
press: 1.00000 atm
elementType: 16 7 7 7 7 7 7 7 6 6 6 6 6 6 1 1 1 1 1 1 1
symmnumber: 1
zpe: 382744.9 jmol-1
zpe.correction: 0.145780 hartree
zpe.thermalcorrener: 0.159528 hartree
zpe.thermalcorrenthalpy: 0.160472 hartree
zpe.thermalcorrgfe: 0.104550 hartree
zpe.sumelectzpe: -1013.153181 hartree
zpe.sumelectthermal: -1013.139432 hartree
zpe.sumelectthermalent: -1013.138488 hartree
zpe.sumelectthermalfe: -1013.194410 hartree
dipole: -11.6351 1.9066 0.0476
dipole: 11.7904
quadrupole: -86.0639 -79.4182 -92.9012
quadrupole: 25.2623 -0.0121 0.0536
quadrupole: 0.0638 6.7096 -6.7734 25.2623 -0.0121 0.0536
hfenergy: -1013.2989604 hartree
pointgroup: C01 [X(C6H7N7S1)]
dipole: 4.587794 -0.6507878 0.2144921 debye
dipolederiv: -0.2488985 -0.1192051 0.1361451 -0.4148507 -0.1460522 0.2397895 0.4029184 0.2149967 -0.1481653 -1.5273135 0.0153135 0.1007989 0.715557 -0.4980604 0.1909398 -0.5277765 0.2509623 -0.3970081 -3.2022374 -0.1003631 0.345046 -0.2763547 -0.4418419 0.1595736 0.4920735 0.1449684 -0.468394 -0.5499867 -0.2880196 0.2613447 -0.1147169 -0.8666986 0.2380526 0.0999756 0.2530174 -0.8560268 -2.050175 0.3367182 -0.1442235 0.4968614 -0.3921027 0.1509164 -0.2908081 0.1644687 -0.3076114 -2.0013706 0.2659758 -0.119911 0.388424 -0.5350853 -0.1860925 -0.2073159 -0.1783658 -0.5329622 -0.6143708 0.0137007 -0.018389 -0.4412777 -0.8485997 0.2503646 0.3958634 0.2102479 -0.8377085 -0.933843 0.0784949 -0.0157814 0.0615368 -0.2984446 -0.0141575 -0.0014947 -0.0157682 -0.2931297 -1.1605961 -0.2335119 0.2936762 -0.5087217 -0.0284001 -0.1110995 0.5445036 -0.1359121 -0.1286475 2.5071255 0.1227296 -0.3253932 -0.7656185 0.4019295 -0.2684365 0.4842331 -0.3450575 0.2974191 0.9608446 0.0469455 -0.1266784 0.1587309 0.0575156 -0.0709068 -0.2317098 -0.0618408 0.0693834 2.4247005 0.0271566 -0.2148148 -0.2348935 0.8651211 -0.5468305 0.0295808 -0.5697101 0.7713414 3.1575116 -0.1554077 -0.1101706 0.8140062 0.8976431 -0.6216249 -0.9937307 -0.5367329 0.8724308 1.4697929 -0.1540217 0.0128138 -0.0854216 0.0002402 0.0416666 -0.047206 0.0480923 -0.0029108 0.0987825 0.0133441 -0.0051066 0.0710065 0.1059046 0.0571445 -0.0573736 0.0625119 0.1253424 0.1760593 0.0518581 -0.031359 0.0574545 0.2960308 0.0619254 -0.0367202 0.0622128 0.3136579 0.2414339 0.0540012 -0.0379464 0.0918232 0.2979536 0.0708297 -0.0741788 0.074679 0.3205913 0.2658405 -0.0270556 0.03358 -0.1142099 0.3059258 0.0923913 0.1099518 0.0855174 0.3102304 0.2804738 -0.0144654 0.0206248 0.0178536 0.2546344 0.1230978 -0.0228906 0.1270746 0.2841916 0.1207639 -0.0150389 0.0406159 0.0070192 0.2933997 0.0930029 0.0226582 0.0966301 0.3051968 0.5854628 0.0808509 -0.0948715 0.0757919 0.2789869 0.0494536 -0.0905536 0.0480079 0.3027791 unknown
polarizability: 329.0121969|-9.6417516|92.5074842|-15.4448628|-36.1062451|85.885727 unknown
InChI: InChI=1S/C6H7N7S/c7-2-12-4(8)3-1-11-6(14-3)13-5(9)10/h1H,8-10H2
charge 0 multiplicity 1
21 atoms
S  0.319903 -1.405587 0.919144
N  1.138903 0.458745 -0.829383
N  2.931314 -0.85566 0.201035
N  -2.829612 -1.359093 1.172502
N  -3.113322 0.403271 -0.42134
N  5.209492 -0.661754 -0.176445
N  3.736503 0.780859 -1.360088
N  -5.649788 0.492657 -0.275974
C  -0.893488 -0.346402 0.073272
C  1.643284 -0.503634 -0.006901
C  -0.238085 0.537943 -0.780306
C  -2.332655 -0.43297 0.277917
C  3.933828 -0.228315 -0.457768
C  -4.444598 0.40338 -0.300997
H  -0.774276 1.266507 -1.388794
H  -3.838171 -1.422699 1.316821
H  -2.219783 -1.98182 1.698778
H  5.298098 -1.417287 0.499201
H  6.038979 -0.252996 -0.596873
H  4.499186 1.238298 -1.855317
H  2.736089 1.045658 -1.504985
