program: Gaussian 09
title: 000178748
version: EM64L-G09RevD.01
frameworkgroup: C1[X(C23H26N2O)]
method: RPBEPBE
basis: SDD
operation: Freq
keyword: #p
keyword: freq=noraman
keyword: PBEPBE/SDD
title: #p freq=noraman PBEPBE/SDD
converged: NO YES NO NO
title: Mulliken charges:
elementType: O N N C C C C C C C C C C C C C C C C C C C C C C C H H H H H H H H H H H H H H H H H H H H H H H H H H
charge: -0.242429 -0.446512 -0.695839 0.214744 -0.100297 -0.099000 -0.099683 -0.524672 -0.515296 -0.516341 -0.450187 -0.449577 -0.448717 0.107731 0.492500 -0.489056 -0.369675 -0.385540 -0.398198 0.372225 0.355019 -0.381214 -0.380182 -0.434130 -0.435214 0.499025 0.200372 0.200298 0.201073 0.232197 0.222308 0.222857 0.175812 0.186412 0.222928 0.198306 0.196510 0.196238 0.198703 0.189309 0.200920 0.295572 0.214380 0.304868 0.232123 0.232341 0.227827 0.231820 0.213544 0.214556 0.304915 0.304327
chargesum: 0.00000
title: Mulliken charges with hydrogens summed into heavy atoms:
elementType: O N N C C C C C C C C C C C C C C C C C C C C C C C
charge: -0.242429 -0.150940 -0.086597 0.214744 0.100075 0.101298 0.101390 -0.070166 -0.116627 -0.107001 -0.055370 -0.054636 -0.058489 0.107731 0.492500 -0.274675 -0.064807 -0.153417 -0.165858 0.372225 0.355019 -0.153387 -0.148362 -0.220586 -0.220658 0.499025
polarizability: 4.90545352e+02 -5.89212662e+00 2.31352446e+02 -2.26355141e+00 3.04348775e+00 1.57569966e+02
1716.lowfreq: -11.7183 -0.5752 -0.0011 -0.0004 0.0011 6.9876 19.0243 27.7793 43.3819
frequency: 16.7766 22.6878 42.3889 47.0135 64.3498 81.0424 94.4099 133.2663 150.4362 185.8239 209.6689 261.7901 291.6850 296.1585 314.4718 325.5812 340.5055 346.4811 361.7676 368.9619 381.0850 394.9476 404.3516 410.4298 412.1433 413.7059 424.6995 432.0430 444.7343 470.2663 515.9333 547.8184 550.4694 629.0227 631.6143 638.5200 641.4171 642.1600 655.2178 686.9691 696.0881 723.3025 743.1856 755.1424 787.4203 808.3078 812.9557 816.0741 817.8795 822.5886 830.5847 844.4277 862.7429 866.4265 868.7844 873.3408 902.2505 938.1267 938.4098 943.1464 945.1378 951.2380 966.9348 972.1524 978.3109 985.7493 989.4970 1004.4166 1017.6524 1024.8179 1040.5932 1051.4069 1053.7336 1059.1830 1101.0750 1102.4304 1106.5075 1109.2866 1115.6233 1126.4695 1135.0349 1175.5930 1183.1363 1190.4935 1199.9410 1207.0838 1250.8818 1256.3950 1267.0145 1284.4909 1287.9822 1293.4605 1293.7039 1303.0401 1304.1239 1312.0012 1314.0362 1316.8948 1322.1236 1325.0710 1341.0164 1344.1595 1348.8662 1352.1793 1357.1495 1362.0786 1375.8792 1418.3130 1439.3786 1445.8041 1452.0821 1460.1280 1463.1678 1466.2626 1482.4018 1491.1567 1497.8706 1535.6117 1569.6334 1584.2994 1602.9183 1622.7360 1633.6845 1644.6481 2949.0842 2961.3660 2961.7105 2965.3559 2966.1586 2989.4058 2992.7385 2998.0102 3009.1293 3017.3196 3019.6615 3024.1478 3028.0856 3030.3863 3056.8139 3103.6880 3114.0029 3116.4696 3135.8662 3140.4831 3143.9461 3148.0423 3195.2305 3520.8871 3567.3058 3707.7392
redmass: 4.5305 4.2393 4.7531 5.8411 4.3542 4.5262 4.6922 5.0808 5.2252 4.1409 3.7909 4.0615 4.4823 1.9876 3.2718 2.5383 3.4174 1.3910 3.9368 1.0353 3.7556 4.7478 4.7987 2.8408 2.4920 2.5787 1.8169 2.0561 3.2367 2.5157 2.6218 6.2698 2.2487 6.4554 1.2312 3.6219 4.0771 6.1152 4.8011 4.9230 7.9654 3.3921 3.5769 4.8829 4.1050 2.8004 1.3475 2.6154 1.6928 3.3991 1.6770 4.9022 1.5299 1.5860 1.5771 1.5695 4.9006 2.0074 1.4306 1.4090 2.0587 1.3614 2.2452 2.2129 2.3488 5.3594 1.3441 2.9351 1.4362 2.4730 1.9150 1.7842 1.8165 4.5250 1.4976 1.3726 1.3930 1.0313 1.0432 1.3936 1.2550 1.5678 1.2095 1.1058 1.3663 1.5562 1.5273 1.7321 1.9110 1.7980 1.8205 1.8414 2.4145 1.6507 1.8183 1.4741 1.5357 1.5583 3.2908 1.3252 1.4507 1.4939 2.4276 1.5562 1.5663 1.5470 6.2828 3.7898 3.8225 1.0906 1.0907 1.0950 1.0961 1.0939 1.1415 1.9563 2.7070 3.2678 5.7466 7.4382 4.2023 6.1329 2.0073 1.9442 1.0631 1.0624 1.0623 1.0617 1.0612 1.0725 1.0838 1.0776 1.0798 1.0997 1.1014 1.1021 1.1011 1.1019 1.1016 1.0884 1.0873 1.0872 1.0917 1.0940 1.0944 1.0954 1.0944 1.0753 1.0448 1.1040
irintensity: 0.0055 1.4402 0.5342 1.7535 3.2114 3.4366 1.1829 0.8251 0.2512 1.6510 3.7823 2.2994 1.7148 0.0239 1.4920 3.4880 44.1545 281.3346 4.5079 1.0306 0.9512 0.4161 2.8377 1.3252 0.4633 1.3527 0.1164 0.1899 0.6822 1.5628 35.3177 1.2483 6.5363 1.7152 41.1306 0.9141 0.5886 1.1265 19.6332 0.2757 2.2713 2.2002 0.4760 1.4762 1.4791 1.5638 0.3784 14.0228 93.2559 29.6982 17.0436 3.5556 25.8443 0.0685 0.1033 0.1434 17.2402 0.2770 1.8627 0.2910 5.3975 0.4777 4.5276 5.5322 19.7308 1.9742 2.7592 0.2681 0.3673 0.5024 0.2001 0.0448 0.2577 13.4661 4.8385 3.2994 1.4487 0.5529 0.9473 15.0751 14.4940 41.4300 2.2600 41.0266 47.1682 9.0965 4.7288 29.0667 26.8750 0.1962 1.3797 0.8843 0.8250 40.9120 14.7923 59.4877 5.9414 13.7707 68.4849 0.0537 2.3256 2.4492 77.0953 32.0966 0.4665 5.3167 23.0789 46.0565 18.4452 0.9014 2.5484 13.3775 12.1975 23.4339 21.9102 79.3053 860.5764 1.5268 38.8835 70.8561 88.3905 2.2583 7.4043 441.4021 43.1156 47.8207 29.2423 34.6250 26.5267 59.3278 130.7010 129.1732 46.6463 8.6299 8.5194 34.2041 78.1683 92.4534 32.5554 35.6752 10.6523 46.9451 7.3758 23.5416 27.0782 4.1212 4.6587 10.2533 121.9701 20.1455
temp: 298.150 k
press: 1.00000 atm
elementType: 8 7 7 6 6 6 6 6 6 6 6 6 6 6 6 6 6 6 6 6 6 6 6 6 6 6 1 1 1 1 1 1 1 1 1 1 1 1 1 1 1 1 1 1 1 1 1 1 1 1 1 1
symmnumber: 1
zpe: 1154475.2 jmol-1
zpe.correction: 0.439716 hartree
zpe.thermalcorrener: 0.461325 hartree
zpe.thermalcorrenthalpy: 0.462269 hartree
zpe.thermalcorrgfe: 0.388169 hartree
zpe.sumelectzpe: -1074.946084 hartree
zpe.sumelectthermal: -1074.924476 hartree
zpe.sumelectthermalent: -1074.923531 hartree
zpe.sumelectthermalfe: -1074.997631 hartree
dipole: 1.5042 -3.3334 0.4741
dipole: 3.6877
quadrupole: -94.0119 -149.3897 -159.4590
quadrupole: 5.7420 -1.9438 2.4811
quadrupole: 40.2749 -15.1028 -25.1721 5.7420 -1.9438 2.4811
hfenergy: -1075.3858004 hartree
pointgroup: C01 [X(C23H26N2O1)]
dipole: -0.598545 1.2992418 0.2421636 debye
polarizability: 490.5924797|-4.7008437|231.4245378|2.4412491|0.153648|157.4507458 unknown
InChI: InChI=1S/C23H26N2O/c24-20-5-1-18(2-6-20)19-3-7-21(8-4-19)25-22(26)23-12-15-9-16(13-23)11-17(10-15)14-23/h1-8,15-17,25H,9-14,24H2
charge 0 multiplicity 1
52 atoms
O  1.773396 -1.984622 -0.364597
N  1.12012 0.20226 0.149362
N  -8.938136 -0.015716 -0.091743
C  3.546863 -0.291373 -0.020872
C  5.97307 -1.060725 -0.168445
C  5.358399 0.854499 1.37078
C  5.309448 1.17979 -1.146334
C  4.491606 -1.514699 -0.196936
C  3.872185 0.401102 1.343793
C  3.824432 0.727537 -1.178108
C  6.281894 -0.381323 1.191989
C  6.232089 -0.056452 -1.32341
C  5.613593 1.860633 0.215747
C  2.078549 -0.784236 -0.089589
C  -0.300108 0.104464 0.11342
C  -1.048693 1.277956 0.40114
C  -0.997209 -1.093547 -0.198569
C  -2.453894 1.258036 0.376203
C  -2.4051 -1.092589 -0.223863
C  -3.173639 0.070838 0.059816
C  -4.659988 0.050312 0.025032
C  -5.413679 1.207579 -0.319781
C  -5.395486 -1.129588 0.330477
C  -6.819004 1.19488 -0.360715
C  -6.800467 -1.15983 0.295401
C  -7.542455 0.006153 -0.052944
H  6.624153 -1.947732 -0.296201
H  5.568222 1.341632 2.343635
H  5.484565 1.899418 -1.970517
H  4.256142 -2.025003 -1.148724
H  4.294523 -2.249898 0.605986
H  3.669885 -0.302897 2.174942
H  3.223622 1.287825 1.507134
H  3.166308 1.615957 -1.082254
H  3.588255 0.252889 -2.150638
H  6.121277 -1.100033 2.020339
H  7.343919 -0.06632 1.231333
H  7.294139 0.261021 -1.324089
H  6.033994 -0.542504 -2.299657
H  4.975976 2.759429 0.343562
H  6.667105 2.203363 0.239748
H  1.483692 1.131251 0.374793
H  -0.526135 2.209644 0.656939
H  -0.428499 -1.996403 -0.425875
H  -3.000857 2.170855 0.636766
H  -2.917927 -2.019614 -0.504021
H  -4.889694 2.130013 -0.595931
H  -4.858698 -2.036093 0.632722
H  -7.364675 2.103616 -0.644318
H  -7.332272 -2.085473 0.548844
H  -9.451555 -0.866537 0.117331
H  -9.46555 0.817153 -0.335303
