program: Gaussian 09
title: 000178760
version: EM64L-G09RevD.01
frameworkgroup: C1[X(C18H23N3O6)]
method: RPBEPBE
basis: SDD
operation: Freq
keyword: #p
keyword: freq=noraman
keyword: PBEPBE/SDD
title: #p freq=noraman PBEPBE/SDD
converged: YES YES NO NO
title: Mulliken charges:
elementType: O O O O O O N N N C C C C C C C C C C C C C C C C C C H H H H H H H H H H H H H H H H H H H H H H H
charge: -0.304648 -0.297566 -0.439620 -0.435972 -0.443012 -0.233434 -0.183691 -0.180560 -0.055563 0.008473 -0.561516 -0.136591 -0.072831 -0.128563 -0.480737 0.343448 -0.377611 0.115050 -0.332900 0.235315 -0.242180 -0.419024 -0.242493 -0.452708 0.200954 -0.070817 -0.769714 0.291150 0.245795 0.270044 0.229658 0.281943 0.300887 0.249618 0.267636 0.247491 0.237461 0.176508 0.225196 0.255087 0.253051 0.269290 0.343530 0.214406 0.200143 0.360774 0.248566 0.204701 0.249872 0.335703
chargesum: 0.00000
title: Mulliken charges with hydrogens summed into heavy atoms:
elementType: O O O O O O N N N C C C C C C C C C C C C C C C C C C
charge: -0.304648 -0.297566 -0.096090 -0.075198 -0.107309 -0.233434 -0.183691 -0.180560 -0.055563 0.299624 -0.045677 0.093067 0.209111 0.172324 0.036517 0.343448 0.107340 0.115050 0.068804 0.235315 0.012907 -0.165973 0.026797 -0.038159 0.200954 -0.070817 -0.066574
polarizability: 2.60388945e+02 -2.92556078e+01 2.67446159e+02 -9.77976599e+00 -2.04815074e+00 1.87744583e+02
1716.lowfreq: -9.6675 -6.5885 -0.0004 0.0003 0.0007 6.0634 12.1584 17.1725 24.1291
frequency: 9.3477 17.0852 24.0842 29.1513 40.7597 47.4510 52.1324 72.1058 93.7160 102.8449 116.5169 124.8689 130.7823 137.4352 151.1074 173.5062 175.2313 198.0949 230.0361 236.7748 270.6891 280.7568 299.1017 320.0898 328.0262 337.9942 347.3176 358.6544 381.1928 386.8735 444.9789 450.9201 467.3915 472.8966 481.3782 513.8010 525.4535 529.4609 577.1088 599.6318 616.4689 630.0291 646.2988 683.8032 692.3310 699.1161 708.6895 732.1558 747.0178 754.2669 764.3938 788.5501 808.4734 837.1893 838.9958 858.3000 863.4777 872.8467 887.6562 913.9528 923.2277 929.9731 957.7170 963.6363 968.8540 984.1395 1009.5167 1012.5417 1015.8338 1021.2678 1047.2299 1054.1206 1056.6529 1060.0256 1060.5068 1074.4536 1095.0570 1127.1085 1134.3749 1160.1316 1170.9125 1175.0182 1179.6802 1181.6524 1191.2470 1199.6389 1214.4742 1235.5131 1253.2056 1261.9319 1270.8165 1282.8107 1287.8636 1292.8875 1300.2683 1301.7782 1314.3694 1321.2907 1329.3189 1334.3008 1354.4370 1360.2308 1373.6216 1376.3525 1388.1903 1402.2942 1403.3986 1423.8154 1436.9453 1444.9994 1453.8459 1454.8536 1461.6504 1465.2068 1467.1156 1472.3202 1493.8345 1508.4933 1585.5830 1590.3254 1653.8326 2923.7351 2963.9549 2985.2650 2986.9919 3006.5340 3018.3582 3036.4068 3046.4255 3056.3001 3068.2033 3071.7975 3071.9970 3081.6638 3091.6279 3098.0997 3100.2253 3119.5384 3171.2186 3201.6557 3238.0815 3526.8893 3550.2783 3564.8691
redmass: 5.7096 5.6135 6.1366 5.2752 6.4405 5.2931 4.1176 3.8242 4.1491 4.1536 3.2009 2.7998 2.4912 1.6467 4.1279 4.2256 2.4864 7.3652 4.0410 3.1495 3.5075 3.6449 2.9013 2.3390 2.1290 2.2806 3.9576 1.8528 4.3338 3.7066 3.1317 3.6731 2.8970 1.2945 3.3121 5.2088 3.1323 4.8162 6.2399 4.1143 4.0123 3.6209 4.5748 9.6064 4.4257 4.6994 3.5769 1.3866 4.7905 7.1722 3.6679 5.0291 3.7104 1.3758 3.8005 2.7758 1.4072 2.8648 3.7437 2.4163 3.4586 3.5070 2.5694 2.1985 2.8188 2.6787 1.9483 3.1932 2.6420 2.2662 1.4908 2.6605 1.7459 2.1555 1.5937 3.1854 2.3505 4.4531 1.3394 1.5509 1.2605 1.1456 1.4016 1.5620 1.5037 2.2729 1.4478 1.3713 1.7634 1.6667 2.8747 1.8334 1.2649 1.3718 1.3474 1.4062 1.4653 1.2972 1.2016 2.1556 1.8302 1.9281 1.4464 1.4876 1.3532 1.2652 5.0162 2.2014 4.5569 1.0442 1.1003 1.7306 1.4590 1.0914 1.0915 1.1023 1.2293 8.9522 8.6953 10.8058 6.6239 1.0700 1.0666 1.0360 1.0839 1.0606 1.0648 1.0679 1.0961 1.0859 1.0969 1.1022 1.0932 1.0949 1.1010 1.0942 1.0887 1.0999 1.0936 1.0928 1.1038 1.0654 1.0661 1.0662
irintensity: 2.3615 2.7934 0.1984 1.3069 2.4844 3.4122 1.1183 2.4480 3.0150 1.5125 1.8410 4.3428 4.2882 0.8520 1.8008 0.6883 5.0238 2.2560 1.2048 17.5510 12.3325 1.4043 29.8591 48.2844 89.3515 64.9477 26.0881 93.5339 3.3405 41.4939 15.7913 3.0006 0.8169 119.0326 9.5695 14.9276 17.6591 10.9943 3.1996 4.7185 3.9535 4.5556 50.5548 4.9273 10.3518 19.3304 6.5643 70.6840 6.4887 8.9451 21.7549 103.9945 27.5169 4.5390 6.7765 62.1647 16.9108 23.6089 140.2312 56.6308 95.3810 78.3490 41.0146 6.5186 71.5647 77.0393 23.8555 110.4847 5.1000 6.4231 5.4385 24.7976 50.2187 8.8198 20.1582 25.4219 1.1465 17.3079 8.4114 51.9293 10.8264 55.2293 22.9823 28.0776 55.8269 199.3169 19.1209 39.9243 47.9322 17.0236 141.4096 61.3202 13.6939 21.6383 32.5682 144.6463 3.6900 47.9295 9.5081 25.6083 11.1931 142.9744 16.9601 23.5517 30.4918 32.0129 1.9112 144.9387 8.1718 11.2729 12.8974 18.4676 1.9807 9.6092 4.5076 5.5241 16.4374 521.2456 17.0091 154.0284 196.7466 70.2403 79.9733 22.6621 45.2934 46.8166 20.0834 6.7271 28.5624 3.8024 11.7697 28.2560 42.0662 3.6840 17.7711 11.6480 1.8134 18.5919 7.1203 4.3197 2.1506 11.2404 3.5866 6.2355
temp: 298.150 k
press: 1.00000 atm
elementType: 8 8 8 8 8 8 7 7 7 6 6 6 6 6 6 6 6 6 6 6 6 6 6 6 6 6 6 1 1 1 1 1 1 1 1 1 1 1 1 1 1 1 1 1 1 1 1 1 1 1
symmnumber: 1
zpe: 1041873.1 jmol-1
zpe.correction: 0.396828 hartree
zpe.thermalcorrener: 0.423208 hartree
zpe.thermalcorrenthalpy: 0.424152 hartree
zpe.thermalcorrgfe: 0.336224 hartree
zpe.sumelectzpe: -1313.234276 hartree
zpe.sumelectthermal: -1313.207897 hartree
zpe.sumelectthermalent: -1313.206953 hartree
zpe.sumelectthermalfe: -1313.294881 hartree
dipole: 1.6900 -5.9477 0.8209
dipole: 6.2374
quadrupole: -146.7229 -182.4831 -154.1314
quadrupole: -2.0143 -24.6129 -16.6534
quadrupole: 14.3895 -21.3706 6.9811 -2.0143 -24.6129 -16.6534
hfenergy: -1313.6311049 hartree
pointgroup: C01 [X(C18H23N3O6)]
dipole: -0.7649277 2.3316605 -0.0176524 debye
polarizability: 263.9413031|-27.9137933|263.7652225|11.1223674|-8.6641547|187.8731615 unknown
InChI: InChI=1S/C18H23N3O6/c1-10-7-21(15-6-12(24)14(9-23)26-15)18(19-17(10)25)27-13-3-5-20-4-2-11(8-22)16(13)20/h2,4,7,12-15,22-24H,3,5-6,8-9H2,1H3
charge 0 multiplicity 1
50 atoms
O  2.515085 1.166309 -1.156079
O  -0.911846 -0.335608 -0.068748
O  1.535672 4.02459 -0.147256
O  5.177593 1.411569 -1.954372
O  -3.503481 0.248671 3.110426
O  1.054157 -4.449753 1.111363
N  -3.907951 0.108604 -1.25396
N  1.390034 -0.453708 0.20394
N  0.037099 -2.419525 0.511134
C  1.479667 0.982093 -0.110613
C  1.944634 1.875472 1.061872
C  2.564133 3.090597 0.337958
C  3.205153 2.476859 -0.926233
C  -2.286466 -1.005377 0.053649
C  -2.597873 -1.853046 -1.214653
C  -3.307239 0.076892 0.007284
C  -3.365959 -0.903551 -2.184894
C  -3.887479 1.089762 0.795368
C  4.705574 2.174844 -0.80223
C  0.170428 -1.143031 0.224624
C  -4.857453 1.113848 -1.306584
C  -4.867135 1.736667 -0.041441
C  2.546631 -1.196756 0.50068
C  -3.54386 1.431909 2.220624
C  2.495321 -2.532794 0.814998
C  1.174217 -3.220029 0.834392
C  3.723058 -3.350564 1.124283
H  0.499611 1.297287 -0.49898
H  2.711482 1.350899 1.660781
H  1.109961 2.150422 1.727973
H  3.307213 3.619721 0.968511
H  2.999727 3.116885 -1.801369
H  -2.244512 -1.602772 0.975509
H  -3.245539 -2.695386 -0.914408
H  -1.683899 -2.279054 -1.653581
H  -2.690911 -0.425506 -2.918389
H  -4.175057 -1.418458 -2.730384
H  4.90666 1.627609 0.147257
H  5.288737 3.111744 -0.801783
H  -5.453689 1.309718 -2.19483
H  -5.51343 2.564384 0.250366
H  3.485079 -0.642212 0.428868
H  1.059481 4.422793 0.624839
H  -2.523441 1.844666 2.309325
H  -4.256604 2.190418 2.607124
H  4.521841 0.682293 -2.114193
H  3.641538 -3.799058 2.131057
H  4.646268 -2.747591 1.071454
H  3.806511 -4.198259 0.420165
H  -4.35384 -0.248784 2.999158
